develooper Front page | perl.daily-build.reports | Postings from January 2023

Smoke [smoke-me/khw-env] v5.37.8-157-gd5055e7288 FAIL(F) linux5.15.89-0-lts [Alpine Linux v3.17 3.17.1] (x86_64/1 cpu)

From:
Carlos Guevara
Date:
January 22, 2023 19:33
Subject:
Smoke [smoke-me/khw-env] v5.37.8-157-gd5055e7288 FAIL(F) linux5.15.89-0-lts [Alpine Linux v3.17 3.17.1] (x86_64/1 cpu)
Message ID:
20230122192645.686021C004C@cjg-alpine3
Automated smoke report for branch smoke-me/khw-env 5.37.9 patch d5055e7288feafc4dff2dec30da15bfe33a9bf1c v5.37.8-157-gd5055e7288
cjg-alpine3: Intel(R) Xeon(R) CPU E5-2620 v2 @ 2.10GHz (GenuineIntel 2138MHz) (x86_64/1 cpu)
    on        linux - 5.15.89-0-lts [Alpine Linux v3.17 3.17.1]
    using     gcc version 12.2.1 20220924
    smoketime 5 hours 35 minutes (average 27 minutes 60 seconds)

Summary: FAIL(F)

O = OK  F = Failure(s), extended report at the bottom
X = Failure(s) under TEST but not under harness
? = still running or test results not (yet) available
Build failures during:       - = unknown or N/A
c = Configure, m = make, M = make (after miniperl), t = make test-prep

v5.37.8-157-gd5055e7288  Configuration (common) -Dcc=gcc
----------- ---------------------------------------------------------
O O         
O O         -Duse64bitall
O O         -Duselongdouble
F F         -Duseithreads
F F         -Duseithreads -Duse64bitall
F F         -Duseithreads -Duselongdouble
| +--------- -DDEBUGGING
+----------- no debugging


Testsuite was run only with 'harness'

Tests skipped on user request:
    # One test name on a line
Failures: (common-args) -Dcc=gcc
[default] -Duseithreads
[default] -DDEBUGGING -Duseithreads
[default] -Duseithreads -Duse64bitall
[default] -DDEBUGGING -Duseithreads -Duse64bitall
[default] -Duseithreads -Duselongdouble
[default] -DDEBUGGING -Duseithreads -Duselongdouble
../t/run/locale.t...........................................FAILED
    Non-zero exit status: 255
    No plan found in TAP output
../lib/locale.t.............................................FAILED
    Non-zero exit status: 255
    No plan found in TAP output
../lib/locale_threads.t.....................................FAILED
    Non-zero exit status: 255
    Bad plan.  You planned 2 tests but ran 0.

MANIFEST did not declare '.mailmap'

Compiler messages(gcc):
proto.h:7006:1: warning: 'S_get_displayable_string' used but never defined
locale.c:3140:1: warning: 'S_setlocale_from_aggregate_LC_ALL' defined but not used [-Wunused-function]
locale.c:633:1: warning: 'S_calculate_LC_ALL' defined but not used [-Wunused-function]
util.c: In function 'Perl_safesysrealloc':
util.c:329:17: warning: pointer 'where' may be used after 'realloc' [-Wuse-after-free]
perl.h:5110:37: note: in definition of macro 'DEBUG_m'
util.c:290:15: note: call to 'realloc' here
hv.c: In function 'Perl_hv_undef_flags':
hv.h:442:26: warning: array subscript [0, 9223372036854775807] is outside array bounds of 'char[0]' [-Warray-bounds]
embed.h:292:78: note: in definition of macro 'hv_common'
hv.h:456:34: note: in expansion of macro 'HEK_FLAGS'
hv.h:561:55: note: in expansion of macro 'HEK_UTF8'
hv.c:2250:19: note: in expansion of macro 'hv_deletehek'
locale.c: In function 'S_toggle_locale_i':
locale.c:7389:14: warning: '%s' directive argument is null [-Wformat-overflow=]
perl.h:5146:33: note: in definition of macro 'DEBUG__'
locale.c:7388:5: note: in expansion of macro 'DEBUG_U'

Non-Fatal messages(gcc):



-- 
Report by Test::Smoke v1.71 running on perl 5.36.0
(Reporter v0.053 / Smoker v0.046)



nntp.perl.org: Perl Programming lists via nntp and http.
Comments to Ask Bjørn Hansen at ask@perl.org | Group listing | About