develooper Front page | perl.daily-build.reports | Postings from November 2022

Smoke [smoke-me/khw-threads] v5.37.5-198-g496ff7ddfc FAIL(F) netbsd8.2 (amd64/1 cpu)

From:
Carlos Guevara
Date:
November 17, 2022 03:34
Subject:
Smoke [smoke-me/khw-threads] v5.37.5-198-g496ff7ddfc FAIL(F) netbsd8.2 (amd64/1 cpu)
Message ID:
20221117033408.B1CEB26C0D0@cjg-netbsd8
Automated smoke report for branch smoke-me/khw-threads 5.37.6 patch 496ff7ddfcee27c757fa4bfdb5b6921af575c04e v5.37.5-198-g496ff7ddfc
cjg-netbsd8: Intel 686-class (amd64/1 cpu)
    on        netbsd - 8.2
    using     gcc version 5.5.0
    smoketime 5 hours 37 minutes (average 42 minutes 10 seconds)

Summary: FAIL(F)

O = OK  F = Failure(s), extended report at the bottom
X = Failure(s) under TEST but not under harness
? = still running or test results not (yet) available
Build failures during:       - = unknown or N/A
c = Configure, m = make, M = make (after miniperl), t = make test-prep

v5.37.5-198-g496ff7ddfc  Configuration (common) -Dcc=gcc
----------- ---------------------------------------------------------
O O         
O O         -Duse64bitall
F F         -Duseithreads
F F         -Duseithreads -Duse64bitall
| +--------- -DDEBUGGING
+----------- no debugging


Testsuite was run only with 'harness'

Tests skipped on user request:
    # One test name on a line
Failures: (common-args) -Dcc=gcc
[default] -Duseithreads
[default] -DDEBUGGING -Duseithreads
[default] -Duseithreads -Duse64bitall
[default] -DDEBUGGING -Duseithreads -Duse64bitall
../t/re/pat_thr.t...........................................FAILED
    Bad plan.  You planned 1214 tests but ran 700.

MANIFEST did not declare '.mailmap'

Compiler messages(gcc):
/usr/include/sys/cdefs_elf.h:67:20: error: missing binary operator before token "("
/usr/include/sys/cdefs_elf.h:73:20: error: missing binary operator before token "("
/usr/include/sys/cdefs_elf.h:79:20: error: missing binary operator before token "("
Socket.c: In function 'XS_Socket_pack_ip_mreq_source':
Socket.c:1710:7: warning: variable 'interface' set but not used [-Wunused-but-set-variable]
const-c.inc: In function 'constant_19':
const-c.inc:351:42: warning: unused parameter 'iv_return' [-Wunused-parameter]
util.c: In function 'Perl_xs_handshake':
util.c:5794:36: warning: comparison is always true due to limited range of data type [-Wtype-limits]

Non-Fatal messages(gcc):



-- 
Report by Test::Smoke v1.71 running on perl 5.26.1
(Reporter v0.053 / Smoker v0.046)



nntp.perl.org: Perl Programming lists via nntp and http.
Comments to Ask Bjørn Hansen at ask@perl.org | Group listing | About