develooper Front page | perl.daily-build.reports | Postings from September 2022

Smoke [blead] v5.37.4-17-gb6198bccd3 PASS netbsd 9.3 (amd64/1 cpu)

From:
Carlos Guevara
Date:
September 23, 2022 00:38
Subject:
Smoke [blead] v5.37.4-17-gb6198bccd3 PASS netbsd 9.3 (amd64/1 cpu)
Message ID:
20220923003816.ADB97B3937@cjg-netbsd9
Automated smoke report for branch blead 5.37.5 patch b6198bccd362ecd980c1b4301ce6817a2ec296e3 v5.37.4-17-gb6198bccd3
cjg-netbsd9: Intel 686-class (amd64/1 cpu)
    on        netbsd - 9.3
    using     gcc version 7.5.0
    smoketime 5 hours 25 minutes (average 40 minutes 38 seconds)

Summary: PASS

O = OK  F = Failure(s), extended report at the bottom
X = Failure(s) under TEST but not under harness
? = still running or test results not (yet) available
Build failures during:       - = unknown or N/A
c = Configure, m = make, M = make (after miniperl), t = make test-prep

v5.37.4-17-gb6198bccd3  Configuration (common) -Dcc=gcc
----------- ---------------------------------------------------------
O O         
O O         -Duse64bitall
O O         -Duseithreads
O O         -Duseithreads -Duse64bitall
| +--------- -DDEBUGGING
+----------- no debugging


Testsuite was run only with 'harness'

Tests skipped on user request:
    # One test name on a line
MANIFEST did not declare '.mailmap'

Compiler messages(gcc):
toke.c: In function 'Perl_yyerror_pvn':
toke.c:12662:14: warning: unused variable 'syntax_error' [-Wunused-variable]
/usr/include/sys/cdefs_elf.h:67:20: error: missing binary operator before token "("
/usr/include/sys/cdefs_elf.h:73:20: error: missing binary operator before token "("
/usr/include/sys/cdefs_elf.h:79:20: error: missing binary operator before token "("
Socket.c: In function 'XS_Socket_pack_ip_mreq_source':
Socket.c:1710:7: warning: variable 'interface' set but not used [-Wunused-but-set-variable]
const-c.inc: In function 'constant_19':
const-c.inc:351:42: warning: unused parameter 'iv_return' [-Wunused-parameter]
Piece.xs: In function '_strptime':
Piece.xs:719:8: warning: 'len' may be used uninitialized in this function [-Wmaybe-uninitialized]
locale.c: In function 'S_my_langinfo_i':
locale.c:3885:28: warning: format '%d' expects argument of type 'int', but argument 3 has type 'nl_item {aka const long int}' [-Wformat=]
perl.h:4999:33: note: in definition of macro 'DEBUG__'
locale.c:3884:5: note: in expansion of macro 'DEBUG_Lv'
locale.c:652:1: warning: 'S_less_dicey_bool_setlocale_r' defined but not used [-Wunused-function]

Non-Fatal messages(gcc):



-- 
Report by Test::Smoke v1.71 running on perl 5.30.2
(Reporter v0.053 / Smoker v0.046)



nntp.perl.org: Perl Programming lists via nntp and http.
Comments to Ask Bjørn Hansen at ask@perl.org | Group listing | About