develooper Front page | perl.daily-build.reports | Postings from June 2022

Smoke [blead] v5.37.1-12-g8bde4793b8 PASS netbsd 8.2 (amd64/1 cpu)

Thread Next
From:
Carlos Guevara
Date:
June 21, 2022 15:26
Subject:
Smoke [blead] v5.37.1-12-g8bde4793b8 PASS netbsd 8.2 (amd64/1 cpu)
Message ID:
20220621152600.8F90926C074@cjg-netbsd8
Automated smoke report for branch blead 5.37.2 patch 8bde4793b8b1dfdd6be2f3ddc1fdf4f7f5c5b01e v5.37.1-12-g8bde4793b8
cjg-netbsd8: Intel 686-class (amd64/1 cpu)
    on        netbsd - 8.2
    using     gcc version 5.5.0
    smoketime 5 hours 50 minutes (average 43 minutes 51 seconds)

Summary: PASS

O = OK  F = Failure(s), extended report at the bottom
X = Failure(s) under TEST but not under harness
? = still running or test results not (yet) available
Build failures during:       - = unknown or N/A
c = Configure, m = make, M = make (after miniperl), t = make test-prep

v5.37.1-12-g8bde4793b8  Configuration (common) -Dcc=gcc
----------- ---------------------------------------------------------
O O         
O O         -Duse64bitall
O O         -Duseithreads
O O         -Duseithreads -Duse64bitall
| +--------- -DDEBUGGING
+----------- no debugging


Testsuite was run only with 'harness'

Tests skipped on user request:
    # One test name on a line
MANIFEST did not declare '.mailmap'

Compiler messages(gcc):
locale.c:1113:1: warning: 'S_calculate_LC_ALL' defined but not used [-Wunused-function]
/usr/include/sys/cdefs_elf.h:67:20: error: missing binary operator before token "("
/usr/include/sys/cdefs_elf.h:73:20: error: missing binary operator before token "("
/usr/include/sys/cdefs_elf.h:79:20: error: missing binary operator before token "("
Socket.c: In function 'XS_Socket_pack_ip_mreq_source':
Socket.c:1703:7: warning: variable 'interface' set but not used [-Wunused-but-set-variable]
const-c.inc: In function 'constant_19':
const-c.inc:351:42: warning: unused parameter 'iv_return' [-Wunused-parameter]
re_exec.c: In function 'S_regtry':
re_exec.c:7099:44: warning: 'fold_array' may be used uninitialized in this function [-Wmaybe-uninitialized]
re_exec.c:7003:24: note: 'fold_array' was declared here
re_exec.c:7105:29: warning: 'folder' may be used uninitialized in this function [-Wmaybe-uninitialized]
re_exec.c:7002:23: note: 'folder' was declared here
util.c: In function 'Perl_xs_handshake':
util.c:5788:36: warning: comparison is always true due to limited range of data type [-Wtype-limits]
regexec.c: In function 'S_regtry':
regexec.c:7099:44: warning: 'fold_array' may be used uninitialized in this function [-Wmaybe-uninitialized]
regexec.c:7003:24: note: 'fold_array' was declared here
regexec.c:7105:29: warning: 'folder' may be used uninitialized in this function [-Wmaybe-uninitialized]
regexec.c:7002:23: note: 'folder' was declared here

Non-Fatal messages(gcc):



-- 
Report by Test::Smoke v1.71 running on perl 5.26.1
(Reporter v0.053 / Smoker v0.046)

Thread Next


nntp.perl.org: Perl Programming lists via nntp and http.
Comments to Ask Bjørn Hansen at ask@perl.org | Group listing | About