develooper Front page | perl.daily-build.reports | Postings from June 2022

Smoke [blead] v5.37.1-6-gd053030d69 FAIL(F) linux 5.15.48-0-lts[Alpine Linux v3.15 3.15.4] (x86_64/1 cpu)

From:
Carlos Guevara
Date:
June 21, 2022 11:54
Subject:
Smoke [blead] v5.37.1-6-gd053030d69 FAIL(F) linux 5.15.48-0-lts[Alpine Linux v3.15 3.15.4] (x86_64/1 cpu)
Message ID:
20220621115407.9DFDE19F336@cjg-alpine3
Automated smoke report for branch blead 5.37.2 patch d053030d69f0e7e8b794edbd8684ec3619463985 v5.37.1-6-gd053030d69
cjg-alpine3: Intel(R) Xeon(R) CPU E5-2620 v2 @ 2.10GHz (GenuineIntel 2100MHz) (x86_64/1 cpu)
    on        linux - 5.15.48-0-lts [Alpine Linux v3.15 3.15.4]
    using     gcc version 10.3.1 20211027
    smoketime 8 hours 28 minutes (average 42 minutes 24 seconds)

Summary: FAIL(F)

O = OK  F = Failure(s), extended report at the bottom
X = Failure(s) under TEST but not under harness
? = still running or test results not (yet) available
Build failures during:       - = unknown or N/A
c = Configure, m = make, M = make (after miniperl), t = make test-prep

v5.37.1-6-gd053030d69  Configuration (common) -Dcc=gcc
----------- ---------------------------------------------------------
O O         
O O         -Duse64bitall
O F         -Duselongdouble
F O         -Duseithreads
O O         -Duseithreads -Duse64bitall
O O         -Duseithreads -Duselongdouble
| +--------- -DDEBUGGING
+----------- no debugging


Testsuite was run only with 'harness'

Tests skipped on user request:
    # One test name on a line
Failures: (common-args) -Dcc=gcc
[default] -DDEBUGGING -Duselongdouble
../cpan/IO-Socket-IP/t/31nonblocking-connect-internet.t.....FAILED
    1
    Non-zero exit status: 22
    No plan found in TAP output
../cpan/Socket/t/getaddrinfo.t..............................FAILED
    22-23
    Non-zero exit status: 2

[default] -Duseithreads
../cpan/IO-Socket-IP/t/31nonblocking-connect-internet.t.....FAILED
    1
    Non-zero exit status: 22
    No plan found in TAP output

MANIFEST did not declare '.mailmap'

Compiler messages(gcc):
Makefile:258: warning: ignoring prerequisites on suffix rule definition
Makefile:254: warning: ignoring prerequisites on suffix rule definition
makefile:258: warning: ignoring prerequisites on suffix rule definition
makefile:254: warning: ignoring prerequisites on suffix rule definition
locale.c:1113:1: warning: 'S_calculate_LC_ALL' defined but not used [-Wunused-function]
locale.c:1232:1: warning: 'S_setlocale_failure_panic_i' defined but not used [-Wunused-function]
locale.c: In function 'S_emulate_setlocale_i':
locale.c:1221:25: warning: 'this_start' may be used uninitialized in this function [-Wmaybe-uninitialized]
locale.c:1155:12: note: 'this_start' was declared here

Non-Fatal messages(gcc):



-- 
Report by Test::Smoke v1.71 running on perl 5.30.2
(Reporter v0.053 / Smoker v0.046)



nntp.perl.org: Perl Programming lists via nntp and http.
Comments to Ask Bjørn Hansen at ask@perl.org | Group listing | About