develooper Front page | perl.daily-build.reports | Postings from May 2022

Smoke [blead] v5.35.11-189-g8c2d1e7253 PASS netbsd 8.2 (amd64/1 cpu)

Thread Previous
From:
Carlos Guevara
Date:
May 14, 2022 09:11
Subject:
Smoke [blead] v5.35.11-189-g8c2d1e7253 PASS netbsd 8.2 (amd64/1 cpu)
Message ID:
20220514091042.5AE1C26C074@cjg-netbsd8
Automated smoke report for branch blead 5.35.12 patch 8c2d1e7253cbf75cbc963441abc87a75a017715a v5.35.11-189-g8c2d1e7253
cjg-netbsd8: Intel 686-class (amd64/1 cpu)
    on        netbsd - 8.2
    using     gcc version 5.5.0
    smoketime 5 hours 47 minutes (average 43 minutes 23 seconds)

Summary: PASS

O = OK  F = Failure(s), extended report at the bottom
X = Failure(s) under TEST but not under harness
? = still running or test results not (yet) available
Build failures during:       - = unknown or N/A
c = Configure, m = make, M = make (after miniperl), t = make test-prep

v5.35.11-189-g8c2d1e7253  Configuration (common) -Dcc=gcc
----------- ---------------------------------------------------------
O O         
O O         -Duse64bitall
O O         -Duseithreads
O O         -Duseithreads -Duse64bitall
| +--------- -DDEBUGGING
+----------- no debugging


Testsuite was run only with 'harness'

Tests skipped on user request:
    # One test name on a line
MANIFEST did not declare '.mailmap'

Compiler messages(gcc):
/usr/include/sys/cdefs_elf.h:67:20: error: missing binary operator before token "("
/usr/include/sys/cdefs_elf.h:73:20: error: missing binary operator before token "("
/usr/include/sys/cdefs_elf.h:79:20: error: missing binary operator before token "("
Socket.c: In function 'XS_Socket_pack_ip_mreq_source':
Socket.c:1703:7: warning: variable 'interface' set but not used [-Wunused-but-set-variable]
const-c.inc: In function 'constant_19':
const-c.inc:351:42: warning: unused parameter 'iv_return' [-Wunused-parameter]
re_exec.c: In function 'S_regtry':
re_exec.c:7072:44: warning: 'fold_array' may be used uninitialized in this function [-Wmaybe-uninitialized]
re_exec.c:6976:24: note: 'fold_array' was declared here
re_exec.c:7078:29: warning: 'folder' may be used uninitialized in this function [-Wmaybe-uninitialized]
re_exec.c:6975:23: note: 'folder' was declared here
util.c: In function 'Perl_xs_handshake':
util.c:5844:36: warning: comparison is always true due to limited range of data type [-Wtype-limits]
regexec.c: In function 'S_regtry':
regexec.c:7072:44: warning: 'fold_array' may be used uninitialized in this function [-Wmaybe-uninitialized]
regexec.c:6976:24: note: 'fold_array' was declared here
regexec.c:7078:29: warning: 'folder' may be used uninitialized in this function [-Wmaybe-uninitialized]
regexec.c:6975:23: note: 'folder' was declared here

Non-Fatal messages(gcc):



-- 
Report by Test::Smoke v1.71 running on perl 5.26.1
(Reporter v0.053 / Smoker v0.046)

Thread Previous


nntp.perl.org: Perl Programming lists via nntp and http.
Comments to Ask Bjørn Hansen at ask@perl.org | Group listing | About