develooper Front page | perl.daily-build.reports | Postings from May 2022

Smoke [blead] v5.35.11-176-gce90e44439 FAIL(F) openbsd 7.0(sparc64/16 cpu)

From:
OpenBSD stable sparc64 Perl Smoker
Date:
May 14, 2022 03:26
Subject:
Smoke [blead] v5.35.11-176-gce90e44439 FAIL(F) openbsd 7.0(sparc64/16 cpu)
Message ID:
<577f48150f86b2f0@perl-sparc64-stable.home.hewus.com> 8F7335A8-D335-11EC-B432-CB998F0A682E-26700269!pb-smtp2.pobox.com
Automated smoke report for branch blead 5.35.12 patch ce90e444392f31a8a610c37beb3963eedbaa73da v5.35.11-176-gce90e44439
perl-sparc64-stable.home.hewus.com: SPARC-T4 (rev 0.0) @ 2847.862 MHz (2847 MHz) (sparc64/16 cpu)
    on        openbsd - 7.0
    using     cc version 4.2.1 20070719
    smoketime 1 day 15 hours 5 minutes (average 4 hours 53 minutes)

Summary: FAIL(F)

O = OK  F = Failure(s), extended report at the bottom
X = Failure(s) under TEST but not under harness
? = still running or test results not (yet) available
Build failures during:       - = unknown or N/A
c = Configure, m = make, M = make (after miniperl), t = make test-prep

v5.35.11-176-gce90e44439  Configuration (common) none
----------- ---------------------------------------------------------
F F F F F F 
F F F F F F -Duseithreads
F F F F F F -Acppflags=-DBIG_TIME -DNO_LOCALE_NUMERIC -DNO_LOCALE_COLLATE
F F F F F F -Acppflags=-DBIG_TIME -DNO_LOCALE_NUMERIC -DNO_LOCALE_COLLATE -Duseithreads
| | | | | +- LC_ALL = UTF-8 -DDEBUGGING
| | | | +--- PERLIO = perlio -DDEBUGGING
| | | +----- PERLIO = stdio  -DDEBUGGING
| | +------- LC_ALL = UTF-8
| +--------- PERLIO = perlio
+----------- PERLIO = stdio 

Tests skipped on user request:
    # One test name on a line
Failures: (common-args) none
[stdio/perlio/UTF-8] 
[stdio/perlio/UTF-8] -DDEBUGGING
[perlio] -Duseithreads
[stdio/perlio] -DDEBUGGING -Duseithreads
[perlio/UTF-8] -Acppflags=-DBIG_TIME -DNO_LOCALE_NUMERIC -DNO_LOCALE_COLLATE
[stdio/perlio/UTF-8] -DDEBUGGING -Acppflags=-DBIG_TIME -DNO_LOCALE_NUMERIC -DNO_LOCALE_COLLATE
[perlio/UTF-8] -Acppflags=-DBIG_TIME -DNO_LOCALE_NUMERIC -DNO_LOCALE_COLLATE -Duseithreads
[stdio/perlio/UTF-8] -DDEBUGGING -Acppflags=-DBIG_TIME -DNO_LOCALE_NUMERIC -DNO_LOCALE_COLLATE -Duseithreads
    ../t/re/reg_mesg.t..........................................FAILED
        No plan found in TAP output
    ../t/re/regex_sets.t........................................FAILED
        No plan found in TAP output

[stdio/UTF-8] -Duseithreads
    ../t/re/reg_mesg.t..........................................FAILED
        No plan found in TAP output
    ../t/re/regex_sets.t........................................FAILED
        No plan found in TAP output
Inconsistent test results (between TEST and harness):
    ../t/re/regexp_qr_embed_thr.t........... ......................................... FAILED--no leader found

[UTF-8] -DDEBUGGING -Duseithreads
    ../t/re/reg_mesg.t..........................................FAILED
        No plan found in TAP output
    ../t/re/regex_sets.t........................................FAILED
        No plan found in TAP output
    ../t/re/regexp_qr_embed_thr.t...............................FAILED
        No plan found in TAP output

[stdio] -Acppflags=-DBIG_TIME -DNO_LOCALE_NUMERIC -DNO_LOCALE_COLLATE
    ../t/re/reg_mesg.t..........................................FAILED
        No plan found in TAP output
    ../t/re/regex_sets.t........................................FAILED
        No plan found in TAP output
Inconsistent test results (between TEST and harness):
    ../lib/warnings.t....................... ..................................................... FAILED at test 828

[stdio] -Acppflags=-DBIG_TIME -DNO_LOCALE_NUMERIC -DNO_LOCALE_COLLATE -Duseithreads
    ../t/re/reg_mesg.t..........................................FAILED
        No plan found in TAP output
    ../t/re/regex_sets.t........................................FAILED
        No plan found in TAP output
    ../t/re/regexp_qr_embed_thr.t...............................FAILED
        No plan found in TAP output
Inconsistent test results (between TEST and harness):
    ../dist/threads/t/free.t................ .............................................. FAILED--expected 29 tests, saw 1

MANIFEST did not declare '.mailmap'

Compiler messages(gcc):


Non-Fatal messages(gcc):



-- 
Report by Test::Smoke v1.78 running on perl 5.32.1
(Reporter v0.054 / Smoker v0.046)



nntp.perl.org: Perl Programming lists via nntp and http.
Comments to Ask Bjørn Hansen at ask@perl.org | Group listing | About