develooper Front page | perl.daily-build.reports | Postings from May 2022

Smoke [smoke-me/jkeenan/Win32-sync-with-cpan-20220511]v5.35.11-163-g5df99aa19d PASS netbsd 9.2 (amd64/1 cpu)

Thread Previous
From:
Carlos Guevara
Date:
May 12, 2022 16:15
Subject:
Smoke [smoke-me/jkeenan/Win32-sync-with-cpan-20220511]v5.35.11-163-g5df99aa19d PASS netbsd 9.2 (amd64/1 cpu)
Message ID:
20220512161458.B54D61222AF@cjg-netbsd9
Automated smoke report for branch smoke-me/jkeenan/Win32-sync-with-cpan-20220511 5.35.12 patch 5df99aa19dda6d1d0a24338e51682890efe37521 v5.35.11-163-g5df99aa19d
cjg-netbsd9: Intel 686-class (amd64/1 cpu)
    on        netbsd - 9.2
    using     gcc version 7.5.0
    smoketime 5 hours 36 minutes (average 42 minutes 2 seconds)

Summary: PASS

O = OK  F = Failure(s), extended report at the bottom
X = Failure(s) under TEST but not under harness
? = still running or test results not (yet) available
Build failures during:       - = unknown or N/A
c = Configure, m = make, M = make (after miniperl), t = make test-prep

v5.35.11-163-g5df99aa19d  Configuration (common) -Dcc=gcc
----------- ---------------------------------------------------------
O O         
O O         -Duse64bitall
O O         -Duseithreads
O O         -Duseithreads -Duse64bitall
| +--------- -DDEBUGGING
+----------- no debugging


Testsuite was run only with 'harness'

Tests skipped on user request:
    # One test name on a line
MANIFEST did not declare '.mailmap'

Compiler messages(gcc):
/usr/include/sys/cdefs_elf.h:67:20: error: missing binary operator before token "("
/usr/include/sys/cdefs_elf.h:73:20: error: missing binary operator before token "("
/usr/include/sys/cdefs_elf.h:79:20: error: missing binary operator before token "("
Socket.c: In function 'XS_Socket_pack_ip_mreq_source':
Socket.c:1703:7: warning: variable 'interface' set but not used [-Wunused-but-set-variable]
const-c.inc: In function 'constant_19':
const-c.inc:351:42: warning: unused parameter 'iv_return' [-Wunused-parameter]
Piece.xs: In function '_strptime':
Piece.xs:719:8: warning: 'len' may be used uninitialized in this function [-Wmaybe-uninitialized]
re_exec.c: In function 'S_regtry':
re_exec.c:7072:44: warning: 'fold_array' may be used uninitialized in this function [-Wmaybe-uninitialized]
re_exec.c:6976:24: note: 'fold_array' was declared here
re_exec.c:7078:29: warning: 'folder' may be used uninitialized in this function [-Wmaybe-uninitialized]
re_exec.c:6975:23: note: 'folder' was declared here
regexec.c: In function 'S_regtry':
regexec.c:7072:44: warning: 'fold_array' may be used uninitialized in this function [-Wmaybe-uninitialized]
regexec.c:6976:24: note: 'fold_array' was declared here
regexec.c:7078:29: warning: 'folder' may be used uninitialized in this function [-Wmaybe-uninitialized]
regexec.c:6975:23: note: 'folder' was declared here

Non-Fatal messages(gcc):



-- 
Report by Test::Smoke v1.71 running on perl 5.30.2
(Reporter v0.053 / Smoker v0.046)

Thread Previous


nntp.perl.org: Perl Programming lists via nntp and http.
Comments to Ask Bjørn Hansen at ask@perl.org | Group listing | About