develooper Front page | perl.daily-build.reports | Postings from November 2021

Smoke [blead] v5.35.6-12-geb87ced FAIL(F) linux 4.4.0-217-generic[Ubuntu 16.04.7 LTS (x86_64/1 cpu)

Thread Next
From:
Carlos Guevara
Date:
November 27, 2021 12:18
Subject:
Smoke [blead] v5.35.6-12-geb87ced FAIL(F) linux 4.4.0-217-generic[Ubuntu 16.04.7 LTS (x86_64/1 cpu)
Message ID:
20211127121831.EAAD016095D@cjg-xenial
Automated smoke report for branch blead 5.35.7 patch eb87cedb600ef8f1265ce27b13197ca7cbc33297 v5.35.6-12-geb87ced
cjg-xenial: Intel(R) Xeon(R) CPU E5-2620 v2 @ 2.10GHz (GenuineIntel 2064MHz) (x86_64/1 cpu)
    on        linux - 4.4.0-217-generic [Ubuntu 16.04.7 LTS (xenial)]
    using     g++ version 5.4.0 20160609
    smoketime 6 hours 34 minutes (average 32 minutes 54 seconds)

Summary: FAIL(F)

O = OK  F = Failure(s), extended report at the bottom
X = Failure(s) under TEST but not under harness
? = still running or test results not (yet) available
Build failures during:       - = unknown or N/A
c = Configure, m = make, M = make (after miniperl), t = make test-prep

v5.35.6-12-geb87ced  Configuration (common) -Dcc=g++
----------- ---------------------------------------------------------
F F         
O O         -Duse64bitall
F F         -Dusequadmath
O O         -Duseithreads
O O         -Duseithreads -Duse64bitall
O O         -Duseithreads -Dusequadmath
| +--------- -DDEBUGGING
+----------- no debugging


Testsuite was run only with 'harness'

Tests skipped on user request:
    # One test name on a line
Failures: (common-args) -Dcc=g++
[default] 
../cpan/ExtUtils-MakeMaker/t/eu_command.t...................FAILED
    8
    Non-zero exit status: 1

[default] -DDEBUGGING
../cpan/ExtUtils-MakeMaker/t/basic.t........................FAILED
    180-184
    Non-zero exit status: 5
../dist/IO/t/io_poll.t......................................FAILED
    12

[default] -Dusequadmath
../cpan/ExtUtils-Constant/t/Constant.t......................FAILED
    205
    Bad plan.  You planned 302 tests but ran 205.

[default] -DDEBUGGING -Dusequadmath
../dist/IO/t/io_poll.t......................................FAILED
    12

MANIFEST did not declare '.mailmap'

Compiler messages(gcc):
regcomp.h: In function 'ssize_t S_study_chunk(RExC_state_t*, regnode**, ssize_t*, ssize_t*, regnode*, scan_data_t*, I32, U32, regnode_ssc*, U32, U32, bool)':
regcomp.h:340:38: warning: '<anonymous>' may be used uninitialized in this function [-Wmaybe-uninitialized]
regcomp.h:312:22: note: '<anonymous>' was declared here
regcomp.h:340:22: note: in expansion of macro 'OP'
regcomp.c:4217:37: note: in expansion of macro 'STR_LEN'
ListUtil.xs: In function 'void XS_List__Util_zip(CV*)':
ListUtil.xs:1619:33: warning: comparison between signed and unsigned integer expressions [-Wsign-compare]
ListUtil.xs:1624:33: warning: comparison between signed and unsigned integer expressions [-Wsign-compare]
ListUtil.xs:1639:31: warning: comparison between signed and unsigned integer expressions [-Wsign-compare]
ListUtil.xs:1658:31: warning: comparison between signed and unsigned integer expressions [-Wsign-compare]
Socket.xs: In function 'void XS_Socket_inet_aton(CV*)':
Socket.xs:773:28: warning: missing initializer for member 'addrinfo::ai_family' [-Wmissing-field-initializers]
Socket.xs:773:28: warning: missing initializer for member 'addrinfo::ai_socktype' [-Wmissing-field-initializers]
Socket.xs:773:28: warning: missing initializer for member 'addrinfo::ai_protocol' [-Wmissing-field-initializers]
Socket.xs:773:28: warning: missing initializer for member 'addrinfo::ai_addrlen' [-Wmissing-field-initializers]
Socket.xs:773:28: warning: missing initializer for member 'addrinfo::ai_addr' [-Wmissing-field-initializers]
Socket.xs:773:28: warning: missing initializer for member 'addrinfo::ai_canonname' [-Wmissing-field-initializers]
Socket.xs:773:28: warning: missing initializer for member 'addrinfo::ai_next' [-Wmissing-field-initializers]
re_exec.c: In function 'bool S_regtry(regmatch_info*, char**)':
re_exec.c:7069:53: warning: 'fold_array' may be used uninitialized in this function [-Wmaybe-uninitialized]
re_exec.c:6973:24: note: 'fold_array' was declared here
re_exec.c:7075:35: warning: 'folder' may be used uninitialized in this function [-Wmaybe-uninitialized]
re_exec.c:6972:23: note: 'folder' was declared here
../../regcomp.h: In function 'ssize_t S_study_chunk(RExC_state_t*, regnode**, ssize_t*, ssize_t*, regnode*, scan_data_t*, I32, U32, regnode_ssc*, U32, U32, bool)':
../../regcomp.h:340:38: warning: '<anonymous>' may be used uninitialized in this function [-Wmaybe-uninitialized]
../../regcomp.h:312:22: note: '<anonymous>' was declared here
../../regcomp.h:340:22: note: in expansion of macro 'OP'
re_comp.c:4184:31: note: in expansion of macro 'STR_LEN'
../../regcomp.h:334:48: warning: '<anonymous>' may be used uninitialized in this function [-Wmaybe-uninitialized]
../../regcomp.h:334:22: note: in expansion of macro '__ASSERT_'
../../regcomp.h:334:32: note: in expansion of macro 'OP'
../../regcomp.h:341:50: note: in expansion of macro 'STR_LENl'
../../regcomp.h:316:48: warning: '<anonymous>' may be used uninitialized in this function [-Wmaybe-uninitialized]
../../regcomp.h:316:22: note: in expansion of macro '__ASSERT_'
../../regcomp.h:316:32: note: in expansion of macro 'OP'
../../regcomp.h:341:64: note: in expansion of macro 'STR_LENs'
re_comp.c:4217:37: note: in expansion of macro 'STR_LEN'
regcomp.c:4184:31: note: in expansion of macro 'STR_LEN'
regcomp.h:334:48: warning: '<anonymous>' may be used uninitialized in this function [-Wmaybe-uninitialized]
regcomp.h:334:22: note: in expansion of macro '__ASSERT_'
regcomp.h:334:32: note: in expansion of macro 'OP'
regcomp.h:341:50: note: in expansion of macro 'STR_LENl'
regcomp.h:316:48: warning: '<anonymous>' may be used uninitialized in this function [-Wmaybe-uninitialized]
regcomp.h:316:22: note: in expansion of macro '__ASSERT_'
regcomp.h:316:32: note: in expansion of macro 'OP'
regcomp.h:341:64: note: in expansion of macro 'STR_LENs'
regcomp.h: In function 'ssize_t S_study_chunk(PerlInterpreter*, RExC_state_t*, regnode**, ssize_t*, ssize_t*, regnode*, scan_data_t*, I32, U32, regnode_ssc*, U32, U32, bool)':
ListUtil.xs: In function 'void XS_List__Util_zip(PerlInterpreter*, CV*)':
Socket.xs: In function 'void XS_Socket_inet_aton(PerlInterpreter*, CV*)':
re_exec.c: In function 'bool S_regtry(PerlInterpreter*, regmatch_info*, char**)':
../../regcomp.h: In function 'ssize_t S_study_chunk(PerlInterpreter*, RExC_state_t*, regnode**, ssize_t*, ssize_t*, regnode*, scan_data_t*, I32, U32, regnode_ssc*, U32, U32, bool)':

Non-Fatal messages(gcc):



-- 
Report by Test::Smoke v1.71 running on perl 5.26.1
(Reporter v0.053 / Smoker v0.046)

Thread Next


nntp.perl.org: Perl Programming lists via nntp and http.
Comments to Ask Bjørn Hansen at ask@perl.org | Group listing | About