develooper Front page | perl.daily-build.reports | Postings from November 2021

Smoke [blead] v5.35.6-12-geb87cedb60 FAIL(F) linux 4.19.0-18-amd64[Debian GNU/Linux 10.11 (x86_64/1 cpu)

Thread Next
From:
Carlos Guevara
Date:
November 26, 2021 22:58
Subject:
Smoke [blead] v5.35.6-12-geb87cedb60 FAIL(F) linux 4.19.0-18-amd64[Debian GNU/Linux 10.11 (x86_64/1 cpu)
Message ID:
E1mqkAR-0002o5-5g@cjg-buster
Automated smoke report for branch blead 5.35.7 patch eb87cedb600ef8f1265ce27b13197ca7cbc33297 v5.35.6-12-geb87cedb60
cjg-buster: Intel(R) Xeon(R) CPU E5-2620 v2 @ 2.10GHz (GenuineIntel 2064MHz) (x86_64/1 cpu)
    on        linux - 4.19.0-18-amd64 [Debian GNU/Linux 10.11 (buster)]
    using     g++ version 8.3.0
    smoketime 7 hours 19 minutes (average 36 minutes 38 seconds)

Summary: FAIL(F)

O = OK  F = Failure(s), extended report at the bottom
X = Failure(s) under TEST but not under harness
? = still running or test results not (yet) available
Build failures during:       - = unknown or N/A
c = Configure, m = make, M = make (after miniperl), t = make test-prep

v5.35.6-12-geb87cedb60  Configuration (common) -Dcc=g++
----------- ---------------------------------------------------------
O O         
O O         -Duse64bitall
O O         -Dusequadmath
F O         -Duseithreads
F O         -Duseithreads -Duse64bitall
F O         -Duseithreads -Dusequadmath
| +--------- -DDEBUGGING
+----------- no debugging


Testsuite was run only with 'harness'

Tests skipped on user request:
    # One test name on a line
Failures: (common-args) -Dcc=g++
[default] -Duseithreads
../dist/Time-HiRes/t/usleep.t...............................FAILED
    5
    Non-zero exit status: 1

[default] -Duseithreads -Duse64bitall
../dist/Time-HiRes/t/usleep.t...............................FAILED
    4
    Non-zero exit status: 1

[default] -Duseithreads -Dusequadmath
../cpan/ExtUtils-Constant/t/Constant.t......................FAILED
    63
    Bad plan.  You planned 302 tests but ran 63.

MANIFEST did not declare '.mailmap'

Compiler messages(gcc):
inflate.c: In function 'int inflate(z_streamp, int)':
inflate.c:724:25: warning: this statement may fall through [-Wimplicit-fallthrough=]
inflate.c:725:9: note: here
inflate.c:732:25: warning: this statement may fall through [-Wimplicit-fallthrough=]
inflate.c:733:9: note: here
inflate.c:947:25: warning: this statement may fall through [-Wimplicit-fallthrough=]
inflate.c:948:9: note: here
inflate.c:968:25: warning: this statement may fall through [-Wimplicit-fallthrough=]
inflate.c:969:9: note: here
MD5.xs: In function 'MD5_CTX* get_md5_ctx(SV*)':
MD5.xs:470:50: warning: type qualifiers ignored on cast result type [-Wignored-qualifiers]
MD5.xs: In function 'SV* new_md5_ctx(MD5_CTX*, const char*)':
MD5.xs:492:63: warning: type qualifiers ignored on cast result type [-Wignored-qualifiers]
../../embed.h:632:63: note: in definition of macro 'sv_magicext'
ListUtil.xs: In function 'void XS_List__Util_zip(CV*)':
ListUtil.xs:1619:33: warning: comparison of integer expressions of different signedness: 'size_t' {aka 'long unsigned int'} and 'int' [-Wsign-compare]
ListUtil.xs:1624:33: warning: comparison of integer expressions of different signedness: 'size_t' {aka 'long unsigned int'} and 'int' [-Wsign-compare]
ListUtil.xs:1639:31: warning: comparison of integer expressions of different signedness: 'int' and 'size_t' {aka 'long unsigned int'} [-Wsign-compare]
ListUtil.xs:1658:31: warning: comparison of integer expressions of different signedness: 'int' and 'size_t' {aka 'long unsigned int'} [-Wsign-compare]
Socket.xs: In function 'void XS_Socket_inet_aton(CV*)':
Socket.xs:773:28: warning: missing initializer for member 'addrinfo::ai_family' [-Wmissing-field-initializers]
Socket.xs:773:28: warning: missing initializer for member 'addrinfo::ai_socktype' [-Wmissing-field-initializers]
Socket.xs:773:28: warning: missing initializer for member 'addrinfo::ai_protocol' [-Wmissing-field-initializers]
Socket.xs:773:28: warning: missing initializer for member 'addrinfo::ai_addrlen' [-Wmissing-field-initializers]
Socket.xs:773:28: warning: missing initializer for member 'addrinfo::ai_addr' [-Wmissing-field-initializers]
Socket.xs:773:28: warning: missing initializer for member 'addrinfo::ai_canonname' [-Wmissing-field-initializers]
Socket.xs:773:28: warning: missing initializer for member 'addrinfo::ai_next' [-Wmissing-field-initializers]
HiRes.xs: In function 'void XS_Time__HiRes_setitimer(CV*)':
HiRes.xs:1248:42: warning: option '-Wc++-compat' is valid for C/ObjC but not for C++ [-Wpragmas]
HiRes.xs: In function 'void XS_Time__HiRes_getitimer(CV*)':
HiRes.xs:1268:42: warning: option '-Wc++-compat' is valid for C/ObjC but not for C++ [-Wpragmas]
MD5.xs: In function 'MD5_CTX* get_md5_ctx(PerlInterpreter*, SV*)':
MD5.xs: In function 'SV* new_md5_ctx(PerlInterpreter*, MD5_CTX*, const char*)':
ListUtil.xs: In function 'void XS_List__Util_zip(PerlInterpreter*, CV*)':
Socket.xs: In function 'void XS_Socket_inet_aton(PerlInterpreter*, CV*)':
HiRes.xs: In function 'void XS_Time__HiRes_setitimer(PerlInterpreter*, CV*)':
HiRes.xs: In function 'void XS_Time__HiRes_getitimer(PerlInterpreter*, CV*)':

Non-Fatal messages(gcc):



-- 
Report by Test::Smoke v1.71 running on perl 5.26.1
(Reporter v0.053 / Smoker v0.046)

Thread Next


nntp.perl.org: Perl Programming lists via nntp and http.
Comments to Ask Bjørn Hansen at ask@perl.org | Group listing | About