develooper Front page | perl.daily-build.reports | Postings from November 2021

Smoke [blead] v5.35.6-12-geb87cedb60 FAIL(F) linux 5.10.0-9-amd64[Debian GNU/Linux 11.1 (x86_64/1 cpu)

Thread Previous
From:
Carlos Guevara
Date:
November 26, 2021 19:48
Subject:
Smoke [blead] v5.35.6-12-geb87cedb60 FAIL(F) linux 5.10.0-9-amd64[Debian GNU/Linux 11.1 (x86_64/1 cpu)
Message ID:
20211126194809.702C8401C5@cjg-bullseye
Automated smoke report for branch blead 5.35.7 patch eb87cedb600ef8f1265ce27b13197ca7cbc33297 v5.35.6-12-geb87cedb60
cjg-bullseye: Intel(R) Xeon(R) CPU E5-2620 v2 @ 2.10GHz (GenuineIntel 2064MHz) (x86_64/1 cpu)
    on        linux - 5.10.0-9-amd64 [Debian GNU/Linux 11.1 (bullseye)]
    using     g++ version 10.2.1 20210110
    smoketime 6 hours 50 minutes (average 34 minutes 14 seconds)

Summary: FAIL(F)

O = OK  F = Failure(s), extended report at the bottom
X = Failure(s) under TEST but not under harness
? = still running or test results not (yet) available
Build failures during:       - = unknown or N/A
c = Configure, m = make, M = make (after miniperl), t = make test-prep

v5.35.6-12-geb87cedb60  Configuration (common) -Dcc=g++
----------- ---------------------------------------------------------
O F         
O O         -Duse64bitall
O F         -Dusequadmath
F F         -Duseithreads
O O         -Duseithreads -Duse64bitall
O F         -Duseithreads -Dusequadmath
| +--------- -DDEBUGGING
+----------- no debugging


Testsuite was run only with 'harness'

Tests skipped on user request:
    # One test name on a line
Failures: (common-args) -Dcc=g++
[default] -DDEBUGGING
../dist/Time-HiRes/t/nanosleep.t............................FAILED
    3
    Non-zero exit status: 1

[default] -DDEBUGGING -Dusequadmath
../cpan/ExtUtils-MakeMaker/t/eu_command.t...................FAILED
    8
    Non-zero exit status: 1
../dist/IO/t/io_poll.t......................................FAILED
    12

[default] -Duseithreads
../dist/Time-HiRes/t/usleep.t...............................FAILED
    6
    Non-zero exit status: 1

[default] -DDEBUGGING -Duseithreads
../dist/IO/t/io_poll.t......................................FAILED
    12

[default] -DDEBUGGING -Duseithreads -Dusequadmath
../dist/Time-HiRes/t/usleep.t...............................FAILED
    5
    Non-zero exit status: 1

MANIFEST did not declare '.mailmap'

Compiler messages(gcc):
awk: cmd. line:1: warning: regexp escape sequence `\=' is not a known regexp operator
Makefile:258: warning: ignoring prerequisites on suffix rule definition
Makefile:254: warning: ignoring prerequisites on suffix rule definition
makefile:258: warning: ignoring prerequisites on suffix rule definition
makefile:254: warning: ignoring prerequisites on suffix rule definition
inflate.c: In function 'int inflate(z_streamp, int)':
inflate.c:724:25: warning: this statement may fall through [-Wimplicit-fallthrough=]
inflate.c:725:9: note: here
inflate.c:732:25: warning: this statement may fall through [-Wimplicit-fallthrough=]
inflate.c:733:9: note: here
inflate.c:947:25: warning: this statement may fall through [-Wimplicit-fallthrough=]
inflate.c:948:9: note: here
inflate.c:968:25: warning: this statement may fall through [-Wimplicit-fallthrough=]
inflate.c:969:9: note: here
MD5.xs: In function 'MD5_CTX* get_md5_ctx(SV*)':
MD5.xs:470:27: warning: type qualifiers ignored on cast result type [-Wignored-qualifiers]
MD5.xs: In function 'SV* new_md5_ctx(MD5_CTX*, const char*)':
MD5.xs:492:40: warning: type qualifiers ignored on cast result type [-Wignored-qualifiers]
../../embed.h:632:63: note: in definition of macro 'sv_magicext'
ListUtil.xs: In function 'void XS_List__Util_zip(CV*)':
ListUtil.xs:1619:33: warning: comparison of integer expressions of different signedness: 'size_t' {aka 'long unsigned int'} and 'int' [-Wsign-compare]
ListUtil.xs:1624:33: warning: comparison of integer expressions of different signedness: 'size_t' {aka 'long unsigned int'} and 'int' [-Wsign-compare]
ListUtil.xs:1639:31: warning: comparison of integer expressions of different signedness: 'int' and 'size_t' {aka 'long unsigned int'} [-Wsign-compare]
ListUtil.xs:1658:31: warning: comparison of integer expressions of different signedness: 'int' and 'size_t' {aka 'long unsigned int'} [-Wsign-compare]
Socket.xs: In function 'void XS_Socket_inet_aton(CV*)':
Socket.xs:773:28: warning: missing initializer for member 'addrinfo::ai_family' [-Wmissing-field-initializers]
Socket.xs:773:28: warning: missing initializer for member 'addrinfo::ai_socktype' [-Wmissing-field-initializers]
Socket.xs:773:28: warning: missing initializer for member 'addrinfo::ai_protocol' [-Wmissing-field-initializers]
Socket.xs:773:28: warning: missing initializer for member 'addrinfo::ai_addrlen' [-Wmissing-field-initializers]
Socket.xs:773:28: warning: missing initializer for member 'addrinfo::ai_addr' [-Wmissing-field-initializers]
Socket.xs:773:28: warning: missing initializer for member 'addrinfo::ai_canonname' [-Wmissing-field-initializers]
Socket.xs:773:28: warning: missing initializer for member 'addrinfo::ai_next' [-Wmissing-field-initializers]
HiRes.xs: In function 'void XS_Time__HiRes_setitimer(CV*)':
../../perl.h:575:30: warning: option '-Wc++-compat' is valid for C/ObjC but not for C++ [-Wpragmas]
../../perl.h:578:30: note: in expansion of macro 'GCC_DIAG_PRAGMA'
../../perl.h:586:33: note: in expansion of macro 'GCC_DIAG_IGNORE'
HiRes.xs:1248:9: note: in expansion of macro 'GCC_DIAG_IGNORE_STMT'
HiRes.xs: In function 'void XS_Time__HiRes_getitimer(CV*)':
HiRes.xs:1268:9: note: in expansion of macro 'GCC_DIAG_IGNORE_STMT'
MD5.xs: In function 'MD5_CTX* get_md5_ctx(PerlInterpreter*, SV*)':
MD5.xs: In function 'SV* new_md5_ctx(PerlInterpreter*, MD5_CTX*, const char*)':
ListUtil.xs: In function 'void XS_List__Util_zip(PerlInterpreter*, CV*)':
Socket.xs: In function 'void XS_Socket_inet_aton(PerlInterpreter*, CV*)':
HiRes.xs: In function 'void XS_Time__HiRes_setitimer(PerlInterpreter*, CV*)':
HiRes.xs: In function 'void XS_Time__HiRes_getitimer(PerlInterpreter*, CV*)':

Non-Fatal messages(gcc):



-- 
Report by Test::Smoke v1.71 running on perl 5.26.1
(Reporter v0.053 / Smoker v0.046)

Thread Previous


nntp.perl.org: Perl Programming lists via nntp and http.
Comments to Ask Bjørn Hansen at ask@perl.org | Group listing | About