develooper Front page | perl.daily-build.reports | Postings from November 2021

Smoke [blead] v5.35.6-12-geb87cedb60 PASS netbsd 8.2 (amd64/1 cpu)

Thread Previous
From:
Carlos Guevara
Date:
November 26, 2021 01:44
Subject:
Smoke [blead] v5.35.6-12-geb87cedb60 PASS netbsd 8.2 (amd64/1 cpu)
Message ID:
20211126014343.08BD726C074@cjg-netbsd8
Automated smoke report for branch blead 5.35.7 patch eb87cedb600ef8f1265ce27b13197ca7cbc33297 v5.35.6-12-geb87cedb60
cjg-netbsd8: Intel 686-class (amd64/1 cpu)
    on        netbsd - 8.2
    using     g++ version 5.5.0
    smoketime 5 hours 35 minutes (average 41 minutes 57 seconds)

Summary: PASS

O = OK  F = Failure(s), extended report at the bottom
X = Failure(s) under TEST but not under harness
? = still running or test results not (yet) available
Build failures during:       - = unknown or N/A
c = Configure, m = make, M = make (after miniperl), t = make test-prep

v5.35.6-12-geb87cedb60  Configuration (common) -Dcc=g++
----------- ---------------------------------------------------------
O O         
O O         -Duse64bitall
O O         -Duseithreads
O O         -Duseithreads -Duse64bitall
| +--------- -DDEBUGGING
+----------- no debugging


Testsuite was run only with 'harness'

Tests skipped on user request:
    # One test name on a line
MANIFEST did not declare '.mailmap'

Compiler messages(gcc):
/usr/include/sys/cdefs_elf.h:67:20: error: missing binary operator before token "("
/usr/include/sys/cdefs_elf.h:73:20: error: missing binary operator before token "("
/usr/include/sys/cdefs_elf.h:79:20: error: missing binary operator before token "("
DB_File.xs: In function 'DB_File_type* ParseOpenInfo(int, char*, int, int, SV*)':
DB_File.xs:476:44: warning: suggest braces around empty body in an 'if' statement [-Wempty-body]
DB_File.xs:1044:13: note: in expansion of macro 'croak_and_free'
DB_File.xs:1050:13: note: in expansion of macro 'croak_and_free'
DB_File.xs:1056:17: note: in expansion of macro 'croak_and_free'
DB_File.xs:1091:17: note: in expansion of macro 'croak_and_free'
DB_File.xs:1140:17: note: in expansion of macro 'croak_and_free'
DB_File.xs:1229:13: note: in expansion of macro 'croak_and_free'
ListUtil.xs: In function 'void XS_List__Util_zip(CV*)':
ListUtil.xs:1619:33: warning: comparison between signed and unsigned integer expressions [-Wsign-compare]
ListUtil.xs:1624:33: warning: comparison between signed and unsigned integer expressions [-Wsign-compare]
ListUtil.xs:1639:31: warning: comparison between signed and unsigned integer expressions [-Wsign-compare]
ListUtil.xs:1658:31: warning: comparison between signed and unsigned integer expressions [-Wsign-compare]
Socket.xs: In function 'void XS_Socket_inet_aton(CV*)':
Socket.xs:773:28: warning: missing initializer for member 'addrinfo::ai_family' [-Wmissing-field-initializers]
Socket.xs:773:28: warning: missing initializer for member 'addrinfo::ai_socktype' [-Wmissing-field-initializers]
Socket.xs:773:28: warning: missing initializer for member 'addrinfo::ai_protocol' [-Wmissing-field-initializers]
Socket.xs:773:28: warning: missing initializer for member 'addrinfo::ai_addrlen' [-Wmissing-field-initializers]
Socket.xs:773:28: warning: missing initializer for member 'addrinfo::ai_canonname' [-Wmissing-field-initializers]
Socket.xs:773:28: warning: missing initializer for member 'addrinfo::ai_addr' [-Wmissing-field-initializers]
Socket.xs:773:28: warning: missing initializer for member 'addrinfo::ai_next' [-Wmissing-field-initializers]
Socket.c: In function 'void XS_Socket_pack_ip_mreq_source(CV*)':
Socket.c:1698:7: warning: variable 'interface' set but not used [-Wunused-but-set-variable]
const-c.inc:351:42: warning: unused parameter 'iv_return' [-Wunused-parameter]
re_exec.c: In function 'bool S_regtry(regmatch_info*, char**)':
re_exec.c:7069:53: warning: 'fold_array' may be used uninitialized in this function [-Wmaybe-uninitialized]
re_exec.c:6973:24: note: 'fold_array' was declared here
re_exec.c:7075:35: warning: 'folder' may be used uninitialized in this function [-Wmaybe-uninitialized]
re_exec.c:6972:23: note: 'folder' was declared here
util.c: In function 'I32 Perl_xs_handshake(U32, void*, const char*, ...)':
util.c:5646:36: warning: comparison is always true due to limited range of data type [-Wtype-limits]
regexec.c: In function 'bool S_regtry(regmatch_info*, char**)':
regexec.c:7069:53: warning: 'fold_array' may be used uninitialized in this function [-Wmaybe-uninitialized]
regexec.c:6973:24: note: 'fold_array' was declared here
regexec.c:7075:35: warning: 'folder' may be used uninitialized in this function [-Wmaybe-uninitialized]
regexec.c:6972:23: note: 'folder' was declared here
DB_File.xs: In function 'DB_File_type* ParseOpenInfo(PerlInterpreter*, int, char*, int, int, SV*)':
ListUtil.xs: In function 'void XS_List__Util_zip(PerlInterpreter*, CV*)':
Socket.xs: In function 'void XS_Socket_inet_aton(PerlInterpreter*, CV*)':
Socket.c: In function 'void XS_Socket_pack_ip_mreq_source(PerlInterpreter*, CV*)':
re_exec.c: In function 'bool S_regtry(PerlInterpreter*, regmatch_info*, char**)':
regexec.c: In function 'bool S_regtry(PerlInterpreter*, regmatch_info*, char**)':

Non-Fatal messages(gcc):



-- 
Report by Test::Smoke v1.71 running on perl 5.26.1
(Reporter v0.053 / Smoker v0.046)

Thread Previous


nntp.perl.org: Perl Programming lists via nntp and http.
Comments to Ask Bjørn Hansen at ask@perl.org | Group listing | About