develooper Front page | perl.daily-build.reports | Postings from October 2021

Smoke [blead] v5.35.5-9-g30194bf8f4 FAIL(F) linux 4.15.0-161-generic[Ubuntu 18.04.6 LTS (x86_64/1 cpu)

Thread Previous
From:
Carlos Guevara
Date:
October 30, 2021 12:10
Subject:
Smoke [blead] v5.35.5-9-g30194bf8f4 FAIL(F) linux 4.15.0-161-generic[Ubuntu 18.04.6 LTS (x86_64/1 cpu)
Message ID:
20211030121025.90439144278@cjg-bionic
Automated smoke report for branch blead 5.35.6 patch 30194bf8f48620eb3926ac41c00a2bc3520c1376 v5.35.5-9-g30194bf8f4
cjg-bionic: Intel(R) Xeon(R) CPU E5-2620 v2 @ 2.10GHz (GenuineIntel 2058MHz) (x86_64/1 cpu)
    on        linux - 4.15.0-161-generic [Ubuntu 18.04.6 LTS (bionic)]
    using     gcc version 7.5.0
    smoketime 6 hours 52 minutes (average 34 minutes 21 seconds)

Summary: FAIL(F)

O = OK  F = Failure(s), extended report at the bottom
X = Failure(s) under TEST but not under harness
? = still running or test results not (yet) available
Build failures during:       - = unknown or N/A
c = Configure, m = make, M = make (after miniperl), t = make test-prep

v5.35.5-9-g30194bf8f4  Configuration (common) -Dcc=gcc
----------- ---------------------------------------------------------
O O         
F O         -Duse64bitall
F O         -Dusequadmath
O O         -Duseithreads
F O         -Duseithreads -Duse64bitall
O O         -Duseithreads -Dusequadmath
| +--------- -DDEBUGGING
+----------- no debugging


Testsuite was run only with 'harness'

Tests skipped on user request:
    # One test name on a line
Failures: (common-args) -Dcc=gcc
[default] -Duse64bitall
../dist/Time-HiRes/t/usleep.t...............................FAILED
    5
    Non-zero exit status: 1

[default] -Dusequadmath
../dist/Time-HiRes/t/usleep.t...............................FAILED
    6
    Non-zero exit status: 1

[default] -Duseithreads -Duse64bitall
../cpan/ExtUtils-MakeMaker/t/eu_command.t...................FAILED
    8
    Non-zero exit status: 1

MANIFEST did not declare '.mailmap'

Compiler messages(gcc):
ListUtil.xs: In function 'XS_List__Util_zip':
ListUtil.xs:1619:33: warning: comparison between signed and unsigned integer expressions [-Wsign-compare]
ListUtil.xs:1624:33: warning: comparison between signed and unsigned integer expressions [-Wsign-compare]
ListUtil.xs:1639:31: warning: comparison between signed and unsigned integer expressions [-Wsign-compare]
ListUtil.xs:1658:31: warning: comparison between signed and unsigned integer expressions [-Wsign-compare]

Non-Fatal messages(gcc):



-- 
Report by Test::Smoke v1.71 running on perl 5.26.1
(Reporter v0.053 / Smoker v0.046)

Thread Previous


nntp.perl.org: Perl Programming lists via nntp and http.
Comments to Ask Bjørn Hansen at ask@perl.org | Group listing | About