develooper Front page | perl.daily-build.reports | Postings from October 2021

Smoke [blead] v5.35.4-120-gc44af6e357 PASS netbsd 9.2 (amd64/1 cpu)

Thread Next
From:
Carlos Guevara
Date:
October 13, 2021 14:23
Subject:
Smoke [blead] v5.35.4-120-gc44af6e357 PASS netbsd 9.2 (amd64/1 cpu)
Message ID:
20211013142301.87BAA122281@cjg-netbsd9
Automated smoke report for branch blead 5.35.5 patch c44af6e357f211a32d6942d405451f8003ff808c v5.35.4-120-gc44af6e357
cjg-netbsd9: Intel 686-class (amd64/1 cpu)
    on        netbsd - 9.2
    using     gcc version 7.5.0
    smoketime 5 hours 23 minutes (average 40 minutes 30 seconds)

Summary: PASS

O = OK  F = Failure(s), extended report at the bottom
X = Failure(s) under TEST but not under harness
? = still running or test results not (yet) available
Build failures during:       - = unknown or N/A
c = Configure, m = make, M = make (after miniperl), t = make test-prep

v5.35.4-120-gc44af6e357  Configuration (common) -Dcc=gcc
----------- ---------------------------------------------------------
O O         
O O         -Duse64bitall
O O         -Duseithreads
O O         -Duseithreads -Duse64bitall
| +--------- -DDEBUGGING
+----------- no debugging


Testsuite was run only with 'harness'

Tests skipped on user request:
    # One test name on a line
MANIFEST did not declare '.mailmap'

Compiler messages(gcc):
/usr/include/sys/cdefs_elf.h:67:20: error: missing binary operator before token "("
/usr/include/sys/cdefs_elf.h:73:20: error: missing binary operator before token "("
/usr/include/sys/cdefs_elf.h:79:20: error: missing binary operator before token "("
DB_File.xs: In function 'ParseOpenInfo':
DB_File.xs:476:44: warning: suggest braces around empty body in an 'if' statement [-Wempty-body]
DB_File.xs:1044:13: note: in expansion of macro 'croak_and_free'
DB_File.xs:1050:13: note: in expansion of macro 'croak_and_free'
DB_File.xs:1056:17: note: in expansion of macro 'croak_and_free'
DB_File.xs:1091:17: note: in expansion of macro 'croak_and_free'
DB_File.xs:1140:17: note: in expansion of macro 'croak_and_free'
DB_File.xs:1229:13: note: in expansion of macro 'croak_and_free'
ListUtil.xs: In function 'XS_List__Util_zip':
../../pp.h:371:40: warning: comparison of unsigned expression < 0 is always false [-Wtype-limits]
../../perl.h:3795:62: note: in definition of macro 'EXPECT'
../../perl.h:3816:52: note: in expansion of macro 'cBOOL'
../../pp.h:390:30: note: in expansion of macro 'UNLIKELY'
../../pp.h:390:39: note: in expansion of macro '_EXTEND_NEEDS_GROW'
ListUtil.xs:1628:9: note: in expansion of macro 'EXTEND'
../../pp.h:371:66: warning: comparison between signed and unsigned integer expressions [-Wsign-compare]
../../pp.h:337:68: warning: signed and unsigned type in conditional expression [-Wsign-compare]
../../embed.h:571:53: note: in definition of macro 'stack_grow'
../../pp.h:391:49: note: in expansion of macro '_EXTEND_SAFE_N'
ListUtil.xs:1645:9: note: in expansion of macro 'EXTEND'
Socket.c: In function 'XS_Socket_pack_ip_mreq_source':
Socket.c:1698:7: warning: variable 'interface' set but not used [-Wunused-but-set-variable]
const-c.inc: In function 'constant_19':
const-c.inc:351:42: warning: unused parameter 'iv_return' [-Wunused-parameter]
Piece.xs: In function '_strptime':
Piece.xs:719:8: warning: 'len' may be used uninitialized in this function [-Wmaybe-uninitialized]
re_exec.c: In function 'S_regtry':
re_exec.c:7069:44: warning: 'fold_array' may be used uninitialized in this function [-Wmaybe-uninitialized]
re_exec.c:6973:24: note: 'fold_array' was declared here
re_exec.c:7075:29: warning: 'folder' may be used uninitialized in this function [-Wmaybe-uninitialized]
re_exec.c:6972:23: note: 'folder' was declared here
regexec.c: In function 'S_regtry':
regexec.c:7069:44: warning: 'fold_array' may be used uninitialized in this function [-Wmaybe-uninitialized]
regexec.c:6973:24: note: 'fold_array' was declared here
regexec.c:7075:29: warning: 'folder' may be used uninitialized in this function [-Wmaybe-uninitialized]
regexec.c:6972:23: note: 'folder' was declared here

Non-Fatal messages(gcc):



-- 
Report by Test::Smoke v1.71 running on perl 5.30.2
(Reporter v0.053 / Smoker v0.046)

Thread Next


nntp.perl.org: Perl Programming lists via nntp and http.
Comments to Ask Bjørn Hansen at ask@perl.org | Group listing | About