develooper Front page | perl.daily-build.reports | Postings from October 2021

Smoke [smoke-me/nicholas/C99] v5.35.4-82-g0788bfbebf FAIL(F) linux5.10.17-v7l+ [Raspbian GNU/Linux 10.8] (armv7l/4 cpu) {smoke-me_gcc_quick}

From:
George Greer
Date:
October 7, 2021 10:12
Subject:
Smoke [smoke-me/nicholas/C99] v5.35.4-82-g0788bfbebf FAIL(F) linux5.10.17-v7l+ [Raspbian GNU/Linux 10.8] (armv7l/4 cpu) {smoke-me_gcc_quick}
Message ID:
202110071012.197ACHHp906883@vier.local
Smoke logs available at http://m-l.org/~perl/smoke/perl/arm-linux-gnueabihf-thread-multi-64int/smoke-me_gcc_quick/Nicholas%20Clark/log0788bfbebf59728f0e7183ab07a27d943d4b692b.log.gz

Automated smoke report for branch smoke-me/nicholas/C99 5.35.5 patch 0788bfbebf59728f0e7183ab07a27d943d4b692b v5.35.4-82-g0788bfbebf
develpi.local: ARMv7 Processor rev 3 (v7l) (300 MHz) (armv7l/4 cpu)
    on        linux - 5.10.17-v7l+ [Raspbian GNU/Linux 10.8]
    using     ccache gcc version 8.3.0
    smoketime 1 hour 48 minutes (average 27 minutes 3 seconds)

Summary: FAIL(F)

O = OK  F = Failure(s), extended report at the bottom
X = Failure(s) under TEST but not under harness
? = still running or test results not (yet) available
Build failures during:       - = unknown or N/A
c = Configure, m = make, M = make (after miniperl), t = make test-prep

v5.35.4-82-g0788bfbebf  Configuration (common) -Accflags="-Werror=declaration-after-statement" -Dcc="ccache gcc"
----------- ---------------------------------------------------------
F F         
F F         -Duseithreads
| +--------- -DDEBUGGING
+----------- no debugging


Testsuite was run only with 'harness' and HARNESS_OPTIONS=j4

Failures: (common-args) -Accflags="-Werror=declaration-after-statement" -Dcc="ccache gcc"
[default] 
[default] -DDEBUGGING
[default] -Duseithreads
[default] -DDEBUGGING -Duseithreads
../dist/ExtUtils-ParseXS/t/001-basic.t......................FAILED
    Non-zero exit status: 2
    Bad plan.  You planned 18 tests but ran 3.
../dist/ExtUtils-ParseXS/t/002-more.t.......................FAILED
    Non-zero exit status: 2
    Bad plan.  You planned 32 tests but ran 2.
../dist/ExtUtils-ParseXS/t/003-usage.t......................FAILED
    Non-zero exit status: 2
    Bad plan.  You planned 24 tests but ran 2.
../lib/ExtUtils/t/Embed.t...................................FAILED
    1, 10

MANIFEST did not declare '.mailmap'

Compiler messages(gcc):
scope.c: In function ‘Perl_leave_scope’:
handy.h:97:35: warning: ‘a2.any_uv’ may be used uninitialized in this function [-Wmaybe-uninitialized]
scope.c:901:21: note: ‘a2.any_uv’ was declared here
ListUtil.xs: In function ‘XS_List__Util_zip’:
../../pp.h:371:40: warning: comparison of unsigned expression < 0 is always false [-Wtype-limits]
../../perl.h:3804:62: note: in definition of macro ‘EXPECT’
../../perl.h:3825:52: note: in expansion of macro ‘cBOOL’
../../pp.h:390:30: note: in expansion of macro ‘UNLIKELY’
../../pp.h:390:39: note: in expansion of macro ‘_EXTEND_NEEDS_GROW’
ListUtil.xs:1628:9: note: in expansion of macro ‘EXTEND’
../../pp.h:371:66: warning: comparison of integer expressions of different signedness: ‘int’ and ‘UV’ {aka ‘long unsigned int’} [-Wsign-compare]
../../pp.h:337:65: warning: operand of ?: changes signedness from ‘int’ to ‘UV’ {aka ‘long unsigned int’} due to unsignedness of other operand [-Wsign-compare]
../../embed.h:571:53: note: in definition of macro ‘stack_grow’
../../pp.h:391:49: note: in expansion of macro ‘_EXTEND_SAFE_N’
ListUtil.xs:1645:9: note: in expansion of macro ‘EXTEND’
re_exec.c: In function ‘S_dump_exec_pos’:
re_exec.c:4415:21: warning: format ‘%u’ expects argument of type ‘unsigned int’, but argument 12 has type ‘U32’ {aka ‘const long unsigned int’} [-Wformat=]
re_exec.c:4415:55: note: format string is defined here
/home/perl/smoke/perl/smoke-me_gcc_quick/build/inline.h: In function ‘Perl_av_store_simple’:
/home/perl/smoke/perl/smoke-me_gcc_quick/build/inline.h:91:5: error: ISO C90 forbids mixed declarations and code [-Werror=declaration-after-statement]
../inline.h: In function ‘Perl_av_store_simple’:
../inline.h:91:5: error: ISO C90 forbids mixed declarations and code [-Werror=declaration-after-statement]
scope.c:901:21: warning: ‘a2.any_uv’ may be used uninitialized in this function [-Wmaybe-uninitialized]
regexec.c: In function ‘S_dump_exec_pos’:
regexec.c:4415:21: warning: format ‘%u’ expects argument of type ‘unsigned int’, but argument 12 has type ‘U32’ {aka ‘const long unsigned int’} [-Wformat=]
regexec.c:4415:55: note: format string is defined here
re_exec.c:4415:21: warning: format ‘%u’ expects argument of type ‘unsigned int’, but argument 13 has type ‘U32’ {aka ‘const long unsigned int’} [-Wformat=]
regexec.c:4415:21: warning: format ‘%u’ expects argument of type ‘unsigned int’, but argument 13 has type ‘U32’ {aka ‘const long unsigned int’} [-Wformat=]

Non-Fatal messages(gcc):

-- 
Report by Test::Smoke v1.72 running on perl 5.28.1
(Reporter v0.053 / Smoker v0.046)




nntp.perl.org: Perl Programming lists via nntp and http.
Comments to Ask Bjørn Hansen at ask@perl.org | Group listing | About