develooper Front page | perl.daily-build.reports | Postings from October 2021

Smoke [blead] v5.35.4-73-g3003b2bc87 FAIL(F) linux 5.14.0-1-arm64[Debian GNU/Linux bookworm/sid] (aarch64/4 cpu)

From:
gregor herrmann
Date:
October 7, 2021 07:39
Subject:
Smoke [blead] v5.35.4-73-g3003b2bc87 FAIL(F) linux 5.14.0-1-arm64[Debian GNU/Linux bookworm/sid] (aarch64/4 cpu)
Message ID:
E1mYNz8-00012g-6Q@7of9.comodo.priv.at
Automated smoke report for branch blead 5.35.5 patch 3003b2bc877517a80f7cba94a9d782ac8c33dcc1 v5.35.4-73-g3003b2bc87
7of9:  (aarch64/4 cpu)
    on        linux - 5.14.0-1-arm64 [Debian GNU/Linux bookworm/sid]
    using     cc version 10.3.0
    smoketime 23 hours 15 minutes (average 2 hours 54 minutes)

Summary: FAIL(F)

O = OK  F = Failure(s), extended report at the bottom
X = Failure(s) under TEST but not under harness
? = still running or test results not (yet) available
Build failures during:       - = unknown or N/A
c = Configure, m = make, M = make (after miniperl), t = make test-prep

v5.35.4-73-g3003b2bc87  Configuration (common) none
----------- ---------------------------------------------------------
F F F F F F 
F F F F F F -Duse64bitint
F F F F F F -Duseithreads
F F F F F F -Duseithreads -Duse64bitint
| | | | | +- LC_ALL = C.UTF-8 -DDEBUGGING
| | | | +--- PERLIO = perlio -DDEBUGGING
| | | +----- PERLIO = stdio  -DDEBUGGING
| | +------- LC_ALL = C.UTF-8
| +--------- PERLIO = perlio
+----------- PERLIO = stdio 

Testsuite was run only with 'harness' and HARNESS_OPTIONS=j5

Tests skipped on user request:
    # One test name on a line
Failures: (common-args) none
[stdio] 
../t/porting/regen.t........................................FAILED
    6-7, 9
../cpan/Socket/t/getaddrinfo.t..............................FAILED
    22-23
    Non-zero exit status: 2

[perlio/C.UTF-8] 
[stdio/perlio/C.UTF-8] -DDEBUGGING
[stdio/perlio/C.UTF-8] -Duse64bitint
[stdio/perlio/C.UTF-8] -DDEBUGGING -Duse64bitint
[stdio/perlio/C.UTF-8] -Duseithreads
[stdio/perlio/C.UTF-8] -DDEBUGGING -Duseithreads
[stdio/perlio/C.UTF-8] -Duseithreads -Duse64bitint
[stdio/perlio/C.UTF-8] -DDEBUGGING -Duseithreads -Duse64bitint
../t/porting/regen.t........................................FAILED
    6-7, 9

MANIFEST did not declare '.mailmap'

Compiler messages(gcc):
makefile:258: warning: ignoring prerequisites on suffix rule definition
makefile:254: warning: ignoring prerequisites on suffix rule definition

Non-Fatal messages(gcc):



-- 
Report by Test::Smoke v1.78 running on perl 5.32.1
(Reporter v0.054 / Smoker v0.046)



nntp.perl.org: Perl Programming lists via nntp and http.
Comments to Ask Bjørn Hansen at ask@perl.org | Group listing | About