develooper Front page | perl.daily-build.reports | Postings from September 2021

Smoke [blead] v5.35.4-18-gfa26526789 FAIL(X) openbsd 6.9 (sparc64/16cpu)

From:
OpenBSD stable sparc64 Perl Smoker
Date:
September 23, 2021 10:39
Subject:
Smoke [blead] v5.35.4-18-gfa26526789 FAIL(X) openbsd 6.9 (sparc64/16cpu)
Message ID:
<9850203fcea28030@perl-sparc64-stable.home.hewus.com> BD39846A-1C56-11EC-90C3-62A2C8D8090B-26700269!pb-smtp1.pobox.com
Automated smoke report for branch blead 5.35.5 patch fa26526789fbf61d704bd6291823c16ed912f342 v5.35.4-18-gfa26526789
perl-sparc64-stable.home.hewus.com: SPARC-T4 (rev 0.0) @ 2847.862 MHz (2847 MHz) (sparc64/16 cpu)
    on        openbsd - 6.9
    using     cc version 4.2.1 20070719
    smoketime 1 day 13 hours 33 minutes (average 4 hours 41 minutes)

Summary: FAIL(X)

O = OK  F = Failure(s), extended report at the bottom
X = Failure(s) under TEST but not under harness
? = still running or test results not (yet) available
Build failures during:       - = unknown or N/A
c = Configure, m = make, M = make (after miniperl), t = make test-prep

v5.35.4-18-gfa26526789  Configuration (common) none
----------- ---------------------------------------------------------
O O O O O O 
X O O O O O -Duseithreads
O O O O O O -Acppflags=-DBIG_TIME -DNO_LOCALE_NUMERIC -DNO_LOCALE_COLLATE
O O X O O O -Acppflags=-DBIG_TIME -DNO_LOCALE_NUMERIC -DNO_LOCALE_COLLATE -Duseithreads
| | | | | +- LC_ALL = UTF-8 -DDEBUGGING
| | | | +--- PERLIO = perlio -DDEBUGGING
| | | +----- PERLIO = stdio  -DDEBUGGING
| | +------- LC_ALL = UTF-8
| +--------- PERLIO = perlio
+----------- PERLIO = stdio 

Tests skipped on user request:
    # One test name on a line
Failures: (common-args) none
[stdio] -Duseithreads
Inconsistent test results (between TEST and harness):
    ../t/re/regexp_qr_embed_thr.t........... ......................................... FAILED--no leader found

[UTF-8] -Acppflags=-DBIG_TIME -DNO_LOCALE_NUMERIC -DNO_LOCALE_COLLATE -Duseithreads
Inconsistent test results (between TEST and harness):
    ../t/re/regexp_qr_embed_thr.t........... ......................................... FAILED--no leader found
    ../dist/threads/t/thread.t.............. ............................................ FAILED--expected 35 tests, saw 24

MANIFEST did not declare '.mailmap'

Compiler messages(gcc):


Non-Fatal messages(gcc):



-- 
Report by Test::Smoke v1.78 running on perl 5.32.1
(Reporter v0.054 / Smoker v0.046)



nntp.perl.org: Perl Programming lists via nntp and http.
Comments to Ask Bjørn Hansen at ask@perl.org | Group listing | About