develooper Front page | perl.daily-build.reports | Postings from June 2021

Smoke [blead] v5.35.1-41-gcb222c4 FAIL(F) linux 4.4.0-211-generic[Ubuntu 16.04.7 LTS (x86_64/1 cpu)

Thread Next
From:
Carlos Guevara
Date:
June 27, 2021 05:38
Subject:
Smoke [blead] v5.35.1-41-gcb222c4 FAIL(F) linux 4.4.0-211-generic[Ubuntu 16.04.7 LTS (x86_64/1 cpu)
Message ID:
20210627053807.EC4A615F540@cjg-xenial
Automated smoke report for branch blead 5.35.2 patch cb222c40b553aa18f3f770a448351317a16b2c47 v5.35.1-41-gcb222c4
cjg-xenial: Intel(R) Xeon(R) CPU E5-2620 v2 @ 2.10GHz (GenuineIntel 2073MHz) (x86_64/1 cpu)
    on        linux - 4.4.0-211-generic [Ubuntu 16.04.7 LTS (xenial)]
    using     g++ version 5.4.0 20160609
    smoketime 6 hours 23 minutes (average 31 minutes 59 seconds)

Summary: FAIL(F)

O = OK  F = Failure(s), extended report at the bottom
X = Failure(s) under TEST but not under harness
? = still running or test results not (yet) available
Build failures during:       - = unknown or N/A
c = Configure, m = make, M = make (after miniperl), t = make test-prep

v5.35.1-41-gcb222c4  Configuration (common) -Dcc=g++
----------- ---------------------------------------------------------
O F         
O F         -Duse64bitall
F F         -Dusequadmath
O O         -Duseithreads
F O         -Duseithreads -Duse64bitall
O O         -Duseithreads -Dusequadmath
| +--------- -DDEBUGGING
+----------- no debugging


Testsuite was run only with 'harness'

Tests skipped on user request:
    # One test name on a line
Failures: (common-args) -Dcc=g++
[default] -DDEBUGGING
../dist/Time-HiRes/t/usleep.t...............................FAILED
    6
    Non-zero exit status: 1

[default] -DDEBUGGING -Duse64bitall
[default] -Duseithreads -Duse64bitall
../dist/Time-HiRes/t/usleep.t...............................FAILED
    5
    Non-zero exit status: 1

[default] -Dusequadmath
../dist/IO/t/io_poll.t......................................FAILED
    12

[default] -DDEBUGGING -Dusequadmath
../cpan/ExtUtils-MakeMaker/t/eu_command.t...................FAILED
    8
    Non-zero exit status: 1

MANIFEST did not declare '.mailmap'

Compiler messages(gcc):
regcomp.h: In function 'ssize_t S_study_chunk(RExC_state_t*, regnode**, ssize_t*, ssize_t*, regnode*, scan_data_t*, I32, U32, regnode_ssc*, U32, U32, bool)':
regcomp.h:340:38: warning: '<anonymous>' may be used uninitialized in this function [-Wmaybe-uninitialized]
regcomp.h:312:22: note: '<anonymous>' was declared here
regcomp.h:340:22: note: in expansion of macro 'OP'
regcomp.c:4217:37: note: in expansion of macro 'STR_LEN'
ListUtil.xs: In function 'void XS_List__Util_zip(CV*)':
../../pp.h:371:40: warning: comparison of unsigned expression < 0 is always false [-Wtype-limits]
../../perl.h:3797:62: note: in definition of macro 'EXPECT'
../../perl.h:3818:52: note: in expansion of macro 'cBOOL'
../../pp.h:390:30: note: in expansion of macro 'UNLIKELY'
../../pp.h:390:39: note: in expansion of macro '_EXTEND_NEEDS_GROW'
ListUtil.xs:1628:9: note: in expansion of macro 'EXTEND'
../../pp.h:371:66: warning: comparison between signed and unsigned integer expressions [-Wsign-compare]
../../pp.h:337:55: warning: comparison between signed and unsigned integer expressions [-Wsign-compare]
../../embed.h:564:53: note: in definition of macro 'stack_grow'
../../pp.h:391:49: note: in expansion of macro '_EXTEND_SAFE_N'
ListUtil.xs:1645:9: note: in expansion of macro 'EXTEND'
Socket.xs: In function 'void XS_Socket_inet_aton(CV*)':
Socket.xs:773:28: warning: missing initializer for member 'addrinfo::ai_family' [-Wmissing-field-initializers]
Socket.xs:773:28: warning: missing initializer for member 'addrinfo::ai_socktype' [-Wmissing-field-initializers]
Socket.xs:773:28: warning: missing initializer for member 'addrinfo::ai_protocol' [-Wmissing-field-initializers]
Socket.xs:773:28: warning: missing initializer for member 'addrinfo::ai_addrlen' [-Wmissing-field-initializers]
Socket.xs:773:28: warning: missing initializer for member 'addrinfo::ai_addr' [-Wmissing-field-initializers]
Socket.xs:773:28: warning: missing initializer for member 'addrinfo::ai_canonname' [-Wmissing-field-initializers]
Socket.xs:773:28: warning: missing initializer for member 'addrinfo::ai_next' [-Wmissing-field-initializers]
re_exec.c: In function 'bool S_regtry(regmatch_info*, char**)':
re_exec.c:7052:53: warning: 'fold_array' may be used uninitialized in this function [-Wmaybe-uninitialized]
re_exec.c:6956:24: note: 'fold_array' was declared here
re_exec.c:7058:35: warning: 'folder' may be used uninitialized in this function [-Wmaybe-uninitialized]
re_exec.c:6955:23: note: 'folder' was declared here
../../regcomp.h: In function 'ssize_t S_study_chunk(RExC_state_t*, regnode**, ssize_t*, ssize_t*, regnode*, scan_data_t*, I32, U32, regnode_ssc*, U32, U32, bool)':
../../regcomp.h:340:38: warning: '<anonymous>' may be used uninitialized in this function [-Wmaybe-uninitialized]
../../regcomp.h:312:22: note: '<anonymous>' was declared here
../../regcomp.h:340:22: note: in expansion of macro 'OP'
re_comp.c:4184:31: note: in expansion of macro 'STR_LEN'
../../regcomp.h:334:48: warning: '<anonymous>' may be used uninitialized in this function [-Wmaybe-uninitialized]
../../regcomp.h:334:22: note: in expansion of macro '__ASSERT_'
../../regcomp.h:334:32: note: in expansion of macro 'OP'
../../regcomp.h:341:50: note: in expansion of macro 'STR_LENl'
../../regcomp.h:316:48: warning: '<anonymous>' may be used uninitialized in this function [-Wmaybe-uninitialized]
../../regcomp.h:316:22: note: in expansion of macro '__ASSERT_'
../../regcomp.h:316:32: note: in expansion of macro 'OP'
../../regcomp.h:341:64: note: in expansion of macro 'STR_LENs'
re_comp.c:4217:37: note: in expansion of macro 'STR_LEN'
regcomp.c:4184:31: note: in expansion of macro 'STR_LEN'
regcomp.h:334:48: warning: '<anonymous>' may be used uninitialized in this function [-Wmaybe-uninitialized]
regcomp.h:334:22: note: in expansion of macro '__ASSERT_'
regcomp.h:334:32: note: in expansion of macro 'OP'
regcomp.h:341:50: note: in expansion of macro 'STR_LENl'
regcomp.h:316:48: warning: '<anonymous>' may be used uninitialized in this function [-Wmaybe-uninitialized]
regcomp.h:316:22: note: in expansion of macro '__ASSERT_'
regcomp.h:316:32: note: in expansion of macro 'OP'
regcomp.h:341:64: note: in expansion of macro 'STR_LENs'
ListUtil.xs: In function 'void XS_List__Util_reduce(CV*)':
ListUtil.xs:581:47: warning: 'retvals' may be used uninitialized in this function [-Wmaybe-uninitialized]
ListUtil.xs:535:9: note: 'retvals' was declared here
regcomp.h: In function 'ssize_t S_study_chunk(PerlInterpreter*, RExC_state_t*, regnode**, ssize_t*, ssize_t*, regnode*, scan_data_t*, I32, U32, regnode_ssc*, U32, U32, bool)':
ListUtil.xs: In function 'void XS_List__Util_zip(PerlInterpreter*, CV*)':
Socket.xs: In function 'void XS_Socket_inet_aton(PerlInterpreter*, CV*)':
re_exec.c: In function 'bool S_regtry(PerlInterpreter*, regmatch_info*, char**)':
../../regcomp.h: In function 'ssize_t S_study_chunk(PerlInterpreter*, RExC_state_t*, regnode**, ssize_t*, ssize_t*, regnode*, scan_data_t*, I32, U32, regnode_ssc*, U32, U32, bool)':
ListUtil.xs: In function 'void XS_List__Util_reduce(PerlInterpreter*, CV*)':

Non-Fatal messages(gcc):



-- 
Report by Test::Smoke v1.71 running on perl 5.26.1
(Reporter v0.053 / Smoker v0.046)

Thread Next


nntp.perl.org: Perl Programming lists via nntp and http.
Comments to Ask Bjørn Hansen at ask@perl.org | Group listing | About