develooper Front page | perl.daily-build.reports | Postings from June 2021

Smoke [smoke-me/jkeenan/corion/remove-exporter-inheritance]v5.35.1-22-g90ca32fb54 FAIL(F) linux 4.9.0-15-amd64 [Debian GNU/Linux 9.13(x86_64/1 cpu)

From:
Carlos Guevara
Date:
June 24, 2021 12:03
Subject:
Smoke [smoke-me/jkeenan/corion/remove-exporter-inheritance]v5.35.1-22-g90ca32fb54 FAIL(F) linux 4.9.0-15-amd64 [Debian GNU/Linux 9.13(x86_64/1 cpu)
Message ID:
E1lwO3g-0001TA-Ru@cjg-stretch
Automated smoke report for branch smoke-me/jkeenan/corion/remove-exporter-inheritance 5.35.2 patch 90ca32fb543401001bd6f10fcb9d6ecc18adee73 v5.35.1-22-g90ca32fb54
cjg-stretch: Intel(R) Xeon(R) CPU E5-2620 v2 @ 2.10GHz (GenuineIntel 2073MHz) (x86_64/1 cpu)
    on        linux - 4.9.0-15-amd64 [Debian GNU/Linux 9.13 (stretch)]
    using     g++ version 6.3.0 20170516
    smoketime 6 hours 44 minutes (average 33 minutes 45 seconds)

Summary: FAIL(F)

O = OK  F = Failure(s), extended report at the bottom
X = Failure(s) under TEST but not under harness
? = still running or test results not (yet) available
Build failures during:       - = unknown or N/A
c = Configure, m = make, M = make (after miniperl), t = make test-prep

v5.35.1-22-g90ca32fb54  Configuration (common) -Dcc=g++
----------- ---------------------------------------------------------
O O         
O O         -Duse64bitall
F O         -Dusequadmath
O O         -Duseithreads
O F         -Duseithreads -Duse64bitall
O F         -Duseithreads -Dusequadmath
| +--------- -DDEBUGGING
+----------- no debugging


Testsuite was run only with 'harness'

Tests skipped on user request:
    # One test name on a line
Failures: (common-args) -Dcc=g++
[default] -Dusequadmath
../cpan/ExtUtils-MakeMaker/t/basic.t........................FAILED
    7
    Non-zero exit status: 1

[default] -DDEBUGGING -Duseithreads -Duse64bitall
../dist/Time-HiRes/t/usleep.t...............................FAILED
    5
    Non-zero exit status: 1

[default] -DDEBUGGING -Duseithreads -Dusequadmath
../dist/Time-HiRes/t/usleep.t...............................FAILED
    3
    Non-zero exit status: 1

MANIFEST did not declare '.mailmap'

Compiler messages(gcc):
ListUtil.xs: In function 'void XS_List__Util_zip(CV*)':
../../pp.h:371:40: warning: comparison of unsigned expression < 0 is always false [-Wtype-limits]
../../perl.h:3797:62: note: in definition of macro 'EXPECT'
../../perl.h:3818:52: note: in expansion of macro 'cBOOL'
../../pp.h:390:30: note: in expansion of macro 'UNLIKELY'
../../pp.h:390:39: note: in expansion of macro '_EXTEND_NEEDS_GROW'
ListUtil.xs:1628:9: note: in expansion of macro 'EXTEND'
../../pp.h:371:66: warning: comparison between signed and unsigned integer expressions [-Wsign-compare]
ListUtil.xs:1645:9: note: in expansion of macro 'EXTEND'
Socket.xs: In function 'void XS_Socket_inet_aton(CV*)':
Socket.xs:773:28: warning: missing initializer for member 'addrinfo::ai_family' [-Wmissing-field-initializers]
Socket.xs:773:28: warning: missing initializer for member 'addrinfo::ai_socktype' [-Wmissing-field-initializers]
Socket.xs:773:28: warning: missing initializer for member 'addrinfo::ai_protocol' [-Wmissing-field-initializers]
Socket.xs:773:28: warning: missing initializer for member 'addrinfo::ai_addrlen' [-Wmissing-field-initializers]
Socket.xs:773:28: warning: missing initializer for member 'addrinfo::ai_addr' [-Wmissing-field-initializers]
Socket.xs:773:28: warning: missing initializer for member 'addrinfo::ai_canonname' [-Wmissing-field-initializers]
Socket.xs:773:28: warning: missing initializer for member 'addrinfo::ai_next' [-Wmissing-field-initializers]
HiRes.xs: In function 'void XS_Time__HiRes_setitimer(CV*)':
HiRes.xs:1248:42: warning: option '-Wc++-compat' is valid for C/ObjC but not for C++ [-Wpragmas]
HiRes.xs: In function 'void XS_Time__HiRes_getitimer(CV*)':
HiRes.xs:1268:42: warning: option '-Wc++-compat' is valid for C/ObjC but not for C++ [-Wpragmas]
ListUtil.xs: In function 'void XS_List__Util_reduce(CV*)':
ListUtil.xs:581:47: warning: 'retvals' may be used uninitialized in this function [-Wmaybe-uninitialized]
ListUtil.xs:535:9: note: 'retvals' was declared here
ListUtil.xs: In function 'void XS_List__Util_zip(PerlInterpreter*, CV*)':
Socket.xs: In function 'void XS_Socket_inet_aton(PerlInterpreter*, CV*)':
HiRes.xs: In function 'void XS_Time__HiRes_setitimer(PerlInterpreter*, CV*)':
HiRes.xs: In function 'void XS_Time__HiRes_getitimer(PerlInterpreter*, CV*)':
ListUtil.xs: In function 'void XS_List__Util_reduce(PerlInterpreter*, CV*)':

Non-Fatal messages(gcc):



-- 
Report by Test::Smoke v1.71 running on perl 5.26.1
(Reporter v0.053 / Smoker v0.046)



nntp.perl.org: Perl Programming lists via nntp and http.
Comments to Ask Bjørn Hansen at ask@perl.org | Group listing | About