develooper Front page | perl.daily-build.reports | Postings from June 2021

Smoke [blead] v5.35.0-122-gf6111fa5f0 PASS netbsd 8.2 (amd64/1 cpu)

From:
Carlos Guevara
Date:
June 11, 2021 00:53
Subject:
Smoke [blead] v5.35.0-122-gf6111fa5f0 PASS netbsd 8.2 (amd64/1 cpu)
Message ID:
20210611005218.20C9F26C073@cjg-netbsd8
Automated smoke report for branch blead 5.35.1 patch f6111fa5f05db77b7dc3d0597790cafcc7763d98 v5.35.0-122-gf6111fa5f0
cjg-netbsd8: Intel 686-class (amd64/1 cpu)
    on        netbsd - 8.2
    using     g++ version 5.5.0
    smoketime 5 hours 22 minutes (average 40 minutes 19 seconds)

Summary: PASS

O = OK  F = Failure(s), extended report at the bottom
X = Failure(s) under TEST but not under harness
? = still running or test results not (yet) available
Build failures during:       - = unknown or N/A
c = Configure, m = make, M = make (after miniperl), t = make test-prep

v5.35.0-122-gf6111fa5f0  Configuration (common) -Dcc=g++
----------- ---------------------------------------------------------
O O         
O O         -Duse64bitall
O O         -Duseithreads
O O         -Duseithreads -Duse64bitall
| +--------- -DDEBUGGING
+----------- no debugging


Testsuite was run only with 'harness'

Tests skipped on user request:
    # One test name on a line
MANIFEST did not declare '.mailmap'

Compiler messages(gcc):
/usr/include/sys/cdefs_elf.h:67:20: error: missing binary operator before token "("
/usr/include/sys/cdefs_elf.h:73:20: error: missing binary operator before token "("
/usr/include/sys/cdefs_elf.h:79:20: error: missing binary operator before token "("
DB_File.xs: In function 'DB_File_type* ParseOpenInfo(int, char*, int, int, SV*)':
DB_File.xs:476:44: warning: suggest braces around empty body in an 'if' statement [-Wempty-body]
DB_File.xs:1044:13: note: in expansion of macro 'croak_and_free'
DB_File.xs:1050:13: note: in expansion of macro 'croak_and_free'
DB_File.xs:1056:17: note: in expansion of macro 'croak_and_free'
DB_File.xs:1091:17: note: in expansion of macro 'croak_and_free'
DB_File.xs:1140:17: note: in expansion of macro 'croak_and_free'
DB_File.xs:1229:13: note: in expansion of macro 'croak_and_free'
ListUtil.xs: In function 'void XS_List__Util_zip(CV*)':
../../pp.h:371:40: warning: comparison of unsigned expression < 0 is always false [-Wtype-limits]
../../perl.h:3797:62: note: in definition of macro 'EXPECT'
../../perl.h:3818:52: note: in expansion of macro 'cBOOL'
../../pp.h:390:30: note: in expansion of macro 'UNLIKELY'
../../pp.h:390:39: note: in expansion of macro '_EXTEND_NEEDS_GROW'
ListUtil.xs:1628:9: note: in expansion of macro 'EXTEND'
../../pp.h:371:66: warning: comparison between signed and unsigned integer expressions [-Wsign-compare]
../../pp.h:337:55: warning: comparison between signed and unsigned integer expressions [-Wsign-compare]
../../embed.h:564:53: note: in definition of macro 'stack_grow'
../../pp.h:391:49: note: in expansion of macro '_EXTEND_SAFE_N'
ListUtil.xs:1645:9: note: in expansion of macro 'EXTEND'
Socket.xs: In function 'void XS_Socket_inet_aton(CV*)':
Socket.xs:769:28: warning: missing initializer for member 'addrinfo::ai_family' [-Wmissing-field-initializers]
Socket.xs:769:28: warning: missing initializer for member 'addrinfo::ai_socktype' [-Wmissing-field-initializers]
Socket.xs:769:28: warning: missing initializer for member 'addrinfo::ai_protocol' [-Wmissing-field-initializers]
Socket.xs:769:28: warning: missing initializer for member 'addrinfo::ai_addrlen' [-Wmissing-field-initializers]
Socket.xs:769:28: warning: missing initializer for member 'addrinfo::ai_canonname' [-Wmissing-field-initializers]
Socket.xs:769:28: warning: missing initializer for member 'addrinfo::ai_addr' [-Wmissing-field-initializers]
Socket.xs:769:28: warning: missing initializer for member 'addrinfo::ai_next' [-Wmissing-field-initializers]
Socket.c: In function 'void XS_Socket_pack_ip_mreq_source(CV*)':
Socket.c:1694:7: warning: variable 'interface' set but not used [-Wunused-but-set-variable]
const-c.inc:351:42: warning: unused parameter 'iv_return' [-Wunused-parameter]
re_exec.c: In function 'bool S_regtry(regmatch_info*, char**)':
re_exec.c:7052:53: warning: 'fold_array' may be used uninitialized in this function [-Wmaybe-uninitialized]
re_exec.c:6956:24: note: 'fold_array' was declared here
re_exec.c:7058:35: warning: 'folder' may be used uninitialized in this function [-Wmaybe-uninitialized]
re_exec.c:6955:23: note: 'folder' was declared here
regexec.c: In function 'bool S_regtry(regmatch_info*, char**)':
regexec.c:7052:53: warning: 'fold_array' may be used uninitialized in this function [-Wmaybe-uninitialized]
regexec.c:6956:24: note: 'fold_array' was declared here
regexec.c:7058:35: warning: 'folder' may be used uninitialized in this function [-Wmaybe-uninitialized]
regexec.c:6955:23: note: 'folder' was declared here
ListUtil.xs: In function 'void XS_List__Util_reduce(CV*)':
ListUtil.xs:581:47: warning: 'retvals' may be used uninitialized in this function [-Wmaybe-uninitialized]
ListUtil.xs:535:9: note: 'retvals' was declared here
DB_File.xs: In function 'DB_File_type* ParseOpenInfo(PerlInterpreter*, int, char*, int, int, SV*)':
ListUtil.xs: In function 'void XS_List__Util_zip(PerlInterpreter*, CV*)':
Socket.xs: In function 'void XS_Socket_inet_aton(PerlInterpreter*, CV*)':
Socket.c: In function 'void XS_Socket_pack_ip_mreq_source(PerlInterpreter*, CV*)':
re_exec.c: In function 'bool S_regtry(PerlInterpreter*, regmatch_info*, char**)':
regexec.c: In function 'bool S_regtry(PerlInterpreter*, regmatch_info*, char**)':
ListUtil.xs: In function 'void XS_List__Util_reduce(PerlInterpreter*, CV*)':

Non-Fatal messages(gcc):



-- 
Report by Test::Smoke v1.71 running on perl 5.26.1
(Reporter v0.053 / Smoker v0.046)



nntp.perl.org: Perl Programming lists via nntp and http.
Comments to Ask Bjørn Hansen at ask@perl.org | Group listing | About