develooper Front page | perl.daily-build.reports | Postings from May 2021

Smoke [smoke-me/khw-env] v5.33.8-335-gd2016003a3 FAIL(F) freebsd11.4-RELEASE-p9 (amd64/1 cpu)

From:
Carlos Guevara
Date:
May 4, 2021 13:10
Subject:
Smoke [smoke-me/khw-env] v5.33.8-335-gd2016003a3 FAIL(F) freebsd11.4-RELEASE-p9 (amd64/1 cpu)
Message ID:
202105041302.144D2t1D047761@cjg-freebsd11
Automated smoke report for branch smoke-me/khw-env 5.33.9 patch d2016003a30e82b7141d899fe3a6a263d090471d v5.33.8-335-gd2016003a3
cjg-freebsd11: Intel(R) Xeon(R) CPU E5-2620 v2 @ 2.10GHz (amd64/1 cpu)
    on        freebsd - 11.4-RELEASE-p9
    using     clang version FreeBSD Clang 10.0.0 (git@github.com:llvm/llvm-project.git llvmorg-10.0.0-0-gd32170dbd5b)
    smoketime 7 hours 30 minutes (average 37 minutes 31 seconds)

Summary: FAIL(F)

O = OK  F = Failure(s), extended report at the bottom
X = Failure(s) under TEST but not under harness
? = still running or test results not (yet) available
Build failures during:       - = unknown or N/A
c = Configure, m = make, M = make (after miniperl), t = make test-prep

v5.33.8-335-gd2016003a3  Configuration (common) -Dcc=clang
----------- ---------------------------------------------------------
O O         
O O         -Duse64bitall
O O         -Duselongdouble
F F         -Duseithreads
F F         -Duseithreads -Duse64bitall
F F         -Duseithreads -Duselongdouble
| +--------- -DDEBUGGING
+----------- no debugging


Testsuite was run only with 'harness'

Tests skipped on user request:
    # One test name on a line
Failures: (common-args) -Dcc=clang
[default] -Duseithreads
[default] -DDEBUGGING -Duseithreads
[default] -Duseithreads -Duse64bitall
[default] -DDEBUGGING -Duseithreads -Duse64bitall
[default] -DDEBUGGING -Duseithreads -Duselongdouble
../t/run/locale.t...........................................FAILED
    10

[default] -Duseithreads -Duselongdouble
../t/run/locale.t...........................................FAILED
    10
../lib/locale_threads.t.....................................FAILED
    2

MANIFEST did not declare '.mailmap'

Passed Todo tests: (common-args) -Dcc=clang
[default] 
[default] -DDEBUGGING
[default] -Duse64bitall
[default] -DDEBUGGING -Duse64bitall
[default] -Duselongdouble
[default] -DDEBUGGING -Duselongdouble
[default] -Duseithreads
[default] -DDEBUGGING -Duseithreads
[default] -Duseithreads -Duse64bitall
[default] -DDEBUGGING -Duseithreads -Duse64bitall
[default] -Duseithreads -Duselongdouble
[default] -DDEBUGGING -Duseithreads -Duselongdouble
../dist/Net-Ping/t/010_pingecho.t...........................PASSED
    2
../dist/Net-Ping/t/450_service.t............................PASSED
    9, 18

Compiler messages(gcc):
locale.c:1534:1: warning: unused function 'S_calculate_LC_ALL' [-Wunused-function]
locale.c:1651:1: warning: unused function 'S_get_LC_ALL_display' [-Wunused-function]
locale.c:169:19: warning: unused variable 'C_codeset' [-Wunused-const-variable]
POSIX.xs:3230:38: warning: variable 'wc' is uninitialized when used here [-Wuninitialized]
../../embed.h:668:51: note: expanded from macro 'sv_setiv_mg'
POSIX.xs:3218:23: note: initialize the variable 'wc' to silence this warning
re_comp.c:8219:37: warning: result of comparison against a string literal is unspecified (use an explicit string comparison function instead) [-Wstring-compare]
../../scope.h:212:25: note: expanded from macro 'LEAVE_with_name'
/usr/include/assert.h:54:21: note: expanded from macro 'assert'
re_comp.c:6647:13: note: expanded from macro 'CHECK_RESTUDY_GOTO_butfirst'
re_comp.c:8267:2: warning: result of comparison against a string literal is unspecified (use an explicit string comparison function instead) [-Wstring-compare]
toke.c:4327:5: warning: result of comparison against a string literal is unspecified (use an explicit string comparison function instead) [-Wstring-compare]
./scope.h:212:25: note: expanded from macro 'LEAVE_with_name'
toke.c:6277:20: warning: result of comparison against a string literal is unspecified (use an explicit string comparison function instead) [-Wstring-compare]
toke.c:12106:3: warning: result of comparison against a string literal is unspecified (use an explicit string comparison function instead) [-Wstring-compare]
regcomp.c:8219:37: warning: result of comparison against a string literal is unspecified (use an explicit string comparison function instead) [-Wstring-compare]
regcomp.c:6647:13: note: expanded from macro 'CHECK_RESTUDY_GOTO_butfirst'
regcomp.c:8267:2: warning: result of comparison against a string literal is unspecified (use an explicit string comparison function instead) [-Wstring-compare]
pp_hot.c:192:17: warning: result of comparison against a string literal is unspecified (use an explicit string comparison function instead) [-Wstring-compare]
pp_hot.c:4562:5: warning: result of comparison against a string literal is unspecified (use an explicit string comparison function instead) [-Wstring-compare]
pp_hot.c:4569:9: warning: result of comparison against a string literal is unspecified (use an explicit string comparison function instead) [-Wstring-compare]
pp.c:5787:2: warning: result of comparison against a string literal is unspecified (use an explicit string comparison function instead) [-Wstring-compare]
pp.c:5843:2: warning: result of comparison against a string literal is unspecified (use an explicit string comparison function instead) [-Wstring-compare]
pp.c:6431:13: warning: result of comparison against a string literal is unspecified (use an explicit string comparison function instead) [-Wstring-compare]
pp_ctl.c:1109:5: warning: result of comparison against a string literal is unspecified (use an explicit string comparison function instead) [-Wstring-compare]
pp_ctl.c:1115:9: warning: result of comparison against a string literal is unspecified (use an explicit string comparison function instead) [-Wstring-compare]
pp_ctl.c:3597:5: warning: result of comparison against a string literal is unspecified (use an explicit string comparison function instead) [-Wstring-compare]
pp_ctl.c:4118:21: warning: result of comparison against a string literal is unspecified (use an explicit string comparison function instead) [-Wstring-compare]
pp_ctl.c:4831:5: warning: result of comparison against a string literal is unspecified (use an explicit string comparison function instead) [-Wstring-compare]
pp_ctl.c:4930:17: warning: result of comparison against a string literal is unspecified (use an explicit string comparison function instead) [-Wstring-compare]
pp_ctl.c:4962:17: warning: result of comparison against a string literal is unspecified (use an explicit string comparison function instead) [-Wstring-compare]
pp_ctl.c:4984:13: warning: result of comparison against a string literal is unspecified (use an explicit string comparison function instead) [-Wstring-compare]
pp_ctl.c:5830:9: warning: result of comparison against a string literal is unspecified (use an explicit string comparison function instead) [-Wstring-compare]
pp_sys.c:312:13: warning: result of comparison against a string literal is unspecified (use an explicit string comparison function instead) [-Wstring-compare]
pp_sys.c:397:5: warning: result of comparison against a string literal is unspecified (use an explicit string comparison function instead) [-Wstring-compare]
pp_sys.c:586:5: warning: result of comparison against a string literal is unspecified (use an explicit string comparison function instead) [-Wstring-compare]
pp_sys.c:989:5: warning: result of comparison against a string literal is unspecified (use an explicit string comparison function instead) [-Wstring-compare]
pp_sys.c:1024:16: warning: result of comparison against a string literal is unspecified (use an explicit string comparison function instead) [-Wstring-compare]
locale.c:2130:64: warning: format specifies type 'size_t' (aka 'unsigned long') but the argument has type 'int' [-Wformat]
/usr/include/stdlib.h:82:20: note: expanded from macro 'MB_CUR_MAX'
./perl.h:4702:44: note: expanded from macro 'DEBUG_L'
./perl.h:4667:33: note: expanded from macro 'DEBUG__'
locale.c:7202:49: warning: format specifies type 'char *' but the argument has type 'int' [-Wformat]
locale.c:7203:22: warning: format specifies type 'int' but the argument has type 'const char *' [-Wformat]
locale.c:7200:73: warning: more '%' conversions than data arguments [-Wformat]
locale.c:3157:1: warning: unused function 'S_lock_and_run_localeconv' [-Wunused-function]

Non-Fatal messages(gcc):



-- 
Report by Test::Smoke v1.71 running on perl 5.30.2
(Reporter v0.053 / Smoker v0.046)



nntp.perl.org: Perl Programming lists via nntp and http.
Comments to Ask Bjørn Hansen at ask@perl.org | Group listing | About