develooper Front page | perl.daily-build.reports | Postings from May 2021

Smoke [smoke-me/khw-env] v5.33.8-335-gd2016003a3 FAIL(F) freebsd12.2-RELEASE-p6 (amd64/1 cpu)

Thread Previous
From:
Carlos Guevara
Date:
May 3, 2021 13:15
Subject:
Smoke [smoke-me/khw-env] v5.33.8-335-gd2016003a3 FAIL(F) freebsd12.2-RELEASE-p6 (amd64/1 cpu)
Message ID:
202105031314.143DEmgB043446@cjg-freebsd12
Automated smoke report for branch smoke-me/khw-env 5.33.9 patch d2016003a30e82b7141d899fe3a6a263d090471d v5.33.8-335-gd2016003a3
cjg-freebsd12: Intel(R) Xeon(R) CPU E5-2620 v2 @ 2.10GHz (amd64/1 cpu)
    on        freebsd - 12.2-RELEASE-p6
    using     clang++ version FreeBSD Clang 10.0.1 (git@github.com:llvm/llvm-project.git llvmorg-10.0.1-0-gef32c611aa2)
    smoketime 7 hours 4 minutes (average 35 minutes 24 seconds)

Summary: FAIL(F)

O = OK  F = Failure(s), extended report at the bottom
X = Failure(s) under TEST but not under harness
? = still running or test results not (yet) available
Build failures during:       - = unknown or N/A
c = Configure, m = make, M = make (after miniperl), t = make test-prep

v5.33.8-335-gd2016003a3  Configuration (common) -Dcc=clang++
----------- ---------------------------------------------------------
O O         
O O         -Duse64bitall
O O         -Duselongdouble
F F         -Duseithreads
F F         -Duseithreads -Duse64bitall
F F         -Duseithreads -Duselongdouble
| +--------- -DDEBUGGING
+----------- no debugging


Testsuite was run only with 'harness'

Tests skipped on user request:
    # One test name on a line
Failures: (common-args) -Dcc=clang++
[default] -Duseithreads
[default] -Duseithreads -Duselongdouble
[default] -DDEBUGGING -Duseithreads -Duselongdouble
../t/run/locale.t...........................................FAILED
    10
../lib/locale_threads.t.....................................FAILED
    Bad plan.  You planned 2 tests but ran 1.

[default] -DDEBUGGING -Duseithreads
../t/run/locale.t...........................................FAILED
    10
../lib/locale_threads.t.....................................FAILED
    2

[default] -Duseithreads -Duse64bitall
[default] -DDEBUGGING -Duseithreads -Duse64bitall
../t/run/locale.t...........................................FAILED
    10

MANIFEST did not declare '.mailmap'

Passed Todo tests: (common-args) -Dcc=clang++
[default] 
[default] -DDEBUGGING
[default] -Duse64bitall
[default] -DDEBUGGING -Duse64bitall
[default] -Duselongdouble
[default] -DDEBUGGING -Duselongdouble
[default] -Duseithreads
[default] -DDEBUGGING -Duseithreads
[default] -Duseithreads -Duse64bitall
[default] -DDEBUGGING -Duseithreads -Duse64bitall
[default] -Duseithreads -Duselongdouble
[default] -DDEBUGGING -Duseithreads -Duselongdouble
../dist/Net-Ping/t/010_pingecho.t...........................PASSED
    2
../dist/Net-Ping/t/450_service.t............................PASSED
    9, 18

Compiler messages(gcc):
regcomp.c:10643:13: warning: converting the result of '?:' with integer constants to a boolean always evaluates to 'true' [-Wtautological-constant-compare]
./regcharclass.h:917:8: note: expanded from macro 'is_MULTI_CHAR_FOLD_latin1_safe'
regcomp.c:10727:13: warning: converting the result of '?:' with integer constants to a boolean always evaluates to 'true' [-Wtautological-constant-compare]
./regcharclass.h:420:49: note: expanded from macro 'is_MULTI_CHAR_FOLD_utf8_safe'
./regcharclass.h:247:8: note: expanded from macro 'is_MULTI_CHAR_FOLD_utf8_safe_part0_'
./regcharclass.h:420:92: note: expanded from macro 'is_MULTI_CHAR_FOLD_utf8_safe'
./regcharclass.h:279:9: note: expanded from macro 'is_MULTI_CHAR_FOLD_utf8_safe_part1_'
./regcharclass.h:302:6: note: expanded from macro 'is_MULTI_CHAR_FOLD_utf8_safe_part1_'
./regcharclass.h:303:9: note: expanded from macro 'is_MULTI_CHAR_FOLD_utf8_safe_part1_'
./regcharclass.h:309:9: note: expanded from macro 'is_MULTI_CHAR_FOLD_utf8_safe_part1_'
./regcharclass.h:426:8: note: expanded from macro 'is_MULTI_CHAR_FOLD_utf8_safe'
./regcharclass.h:479:19: note: expanded from macro 'is_MULTI_CHAR_FOLD_utf8_safe'
./regcharclass.h:332:8: note: expanded from macro 'is_MULTI_CHAR_FOLD_utf8_safe_part2_'
./regcharclass.h:479:62: note: expanded from macro 'is_MULTI_CHAR_FOLD_utf8_safe'
./regcharclass.h:390:8: note: expanded from macro 'is_MULTI_CHAR_FOLD_utf8_safe_part3_'
regcomp.c:15197:37: warning: converting the result of '?:' with integer constants to a boolean always evaluates to 'true' [-Wtautological-constant-compare]
./regcharclass.h:994:4: note: expanded from macro 'is_THREE_CHAR_FOLD_HEAD_utf8_safe'
./regcharclass.h:1002:8: note: expanded from macro 'is_THREE_CHAR_FOLD_HEAD_utf8_safe'
./regcharclass.h:1004:8: note: expanded from macro 'is_THREE_CHAR_FOLD_HEAD_utf8_safe'
./regcharclass.h:1009:8: note: expanded from macro 'is_THREE_CHAR_FOLD_HEAD_utf8_safe'
./regcharclass.h:1011:8: note: expanded from macro 'is_THREE_CHAR_FOLD_HEAD_utf8_safe'
./regcharclass.h:1023:4: note: expanded from macro 'is_THREE_CHAR_FOLD_HEAD_utf8_safe'
./regcharclass.h:1042:4: note: expanded from macro 'is_THREE_CHAR_FOLD_HEAD_utf8_safe'
regcomp.c:15248:38: warning: converting the result of '?:' with integer constants to a boolean always evaluates to 'true' [-Wtautological-constant-compare]
regcomp.c:15296:37: warning: converting the result of '?:' with integer constants to a boolean always evaluates to 'true' [-Wtautological-constant-compare]
./regcharclass.h:1066:4: note: expanded from macro 'is_THREE_CHAR_FOLD_HEAD_latin1_safe'
regcomp.c:15317:38: warning: converting the result of '?:' with integer constants to a boolean always evaluates to 'true' [-Wtautological-constant-compare]
regexec.c:2977:35: warning: converting the result of '?:' with integer constants to a boolean always evaluates to 'true' [-Wtautological-constant-compare]
./regcharclass.h:58:4: note: expanded from macro 'is_LNBREAK_utf8_safe'
./regcharclass.h:65:4: note: expanded from macro 'is_LNBREAK_utf8_safe'
regexec.c:2982:32: warning: converting the result of '?:' with integer constants to a boolean always evaluates to 'true' [-Wtautological-constant-compare]
./regcharclass.h:76:4: note: expanded from macro 'is_LNBREAK_latin1_safe'
locale.c:2277:27: warning: array subscript is of type 'char' [-Wchar-subscripts]
locale.c:2278:27: warning: array subscript is of type 'char' [-Wchar-subscripts]
locale.c:1534:1: warning: unused function 'S_calculate_LC_ALL' [-Wunused-function]
locale.c:1651:1: warning: unused function 'S_get_LC_ALL_display' [-Wunused-function]
locale.c:169:19: warning: unused variable 'C_codeset' [-Wunused-const-variable]
DynaLoader.c:547:1: warning: duplicate 'extern' declaration specifier [-Wduplicate-decl-specifier]
../../XSUB.h:146:29: note: expanded from macro 'XS_EXTERNAL'
B.c:3662:1: warning: duplicate 'extern' declaration specifier [-Wduplicate-decl-specifier]
Bzip2.c:1674:1: warning: duplicate 'extern' declaration specifier [-Wduplicate-decl-specifier]
compress.c:190:13: warning: 'register' storage class specifier is deprecated and incompatible with C++17 [-Wdeprecated-register]
compress.c:191:13: warning: 'register' storage class specifier is deprecated and incompatible with C++17 [-Wdeprecated-register]
compress.c:192:13: warning: 'register' storage class specifier is deprecated and incompatible with C++17 [-Wdeprecated-register]
compress.c:198:16: warning: 'register' storage class specifier is deprecated and incompatible with C++17 [-Wdeprecated-register]
compress.c:361:13: warning: 'register' storage class specifier is deprecated and incompatible with C++17 [-Wdeprecated-register]
compress.c:362:13: warning: 'register' storage class specifier is deprecated and incompatible with C++17 [-Wdeprecated-register]
Zlib.c:3717:1: warning: duplicate 'extern' declaration specifier [-Wduplicate-decl-specifier]
deflate.c:1243:5: warning: 'register' storage class specifier is deprecated and incompatible with C++17 [-Wdeprecated-register]
deflate.c:1244:5: warning: 'register' storage class specifier is deprecated and incompatible with C++17 [-Wdeprecated-register]
deflate.c:1245:5: warning: 'register' storage class specifier is deprecated and incompatible with C++17 [-Wdeprecated-register]
deflate.c:1264:5: warning: 'register' storage class specifier is deprecated and incompatible with C++17 [-Wdeprecated-register]
deflate.c:1265:5: warning: 'register' storage class specifier is deprecated and incompatible with C++17 [-Wdeprecated-register]
deflate.c:1266:5: warning: 'register' storage class specifier is deprecated and incompatible with C++17 [-Wdeprecated-register]
deflate.c:54:12: warning: unused variable 'deflate_copyright' [-Wunused-const-variable]
inftrees.c:11:12: warning: unused variable 'inflate_copyright' [-Wunused-const-variable]
trees.c:1164:5: warning: 'register' storage class specifier is deprecated and incompatible with C++17 [-Wdeprecated-register]
Cwd.c:1091:1: warning: duplicate 'extern' declaration specifier [-Wduplicate-decl-specifier]
DB_File.c:3067:1: warning: duplicate 'extern' declaration specifier [-Wduplicate-decl-specifier]
Dumper.c:1952:1: warning: duplicate 'extern' declaration specifier [-Wduplicate-decl-specifier]
RealPPPort.c:8259:1: warning: duplicate 'extern' declaration specifier [-Wduplicate-decl-specifier]
Peek.c:839:1: warning: duplicate 'extern' declaration specifier [-Wduplicate-decl-specifier]
MD5.c:1058:1: warning: duplicate 'extern' declaration specifier [-Wduplicate-decl-specifier]
SHA.c:723:1: warning: duplicate 'extern' declaration specifier [-Wduplicate-decl-specifier]
Byte.c:187:1: warning: duplicate 'extern' declaration specifier [-Wduplicate-decl-specifier]
../../../XSUB.h:146:29: note: expanded from macro 'XS_EXTERNAL'
CN.c:192:1: warning: duplicate 'extern' declaration specifier [-Wduplicate-decl-specifier]
EBCDIC.c:187:1: warning: duplicate 'extern' declaration specifier [-Wduplicate-decl-specifier]
JP.c:193:1: warning: duplicate 'extern' declaration specifier [-Wduplicate-decl-specifier]
KR.c:191:1: warning: duplicate 'extern' declaration specifier [-Wduplicate-decl-specifier]
Symbol.c:187:1: warning: duplicate 'extern' declaration specifier [-Wduplicate-decl-specifier]
TW.c:190:1: warning: duplicate 'extern' declaration specifier [-Wduplicate-decl-specifier]
Unicode.c:704:1: warning: duplicate 'extern' declaration specifier [-Wduplicate-decl-specifier]
Encode.c:1581:1: warning: duplicate 'extern' declaration specifier [-Wduplicate-decl-specifier]
Fcntl.c:315:1: warning: duplicate 'extern' declaration specifier [-Wduplicate-decl-specifier]
DosGlob.c:208:1: warning: duplicate 'extern' declaration specifier [-Wduplicate-decl-specifier]
Glob.c:706:1: warning: duplicate 'extern' declaration specifier [-Wduplicate-decl-specifier]
Call.c:464:1: warning: duplicate 'extern' declaration specifier [-Wduplicate-decl-specifier]
GDBM_File.c:1606:1: warning: duplicate 'extern' declaration specifier [-Wduplicate-decl-specifier]
Util.c:720:1: warning: duplicate 'extern' declaration specifier [-Wduplicate-decl-specifier]
FieldHash.c:718:1: warning: duplicate 'extern' declaration specifier [-Wduplicate-decl-specifier]
Langinfo.c:257:1: warning: duplicate 'extern' declaration specifier [-Wduplicate-decl-specifier]
IO.c:972:1: warning: duplicate 'extern' declaration specifier [-Wduplicate-decl-specifier]
SysV.c:831:1: warning: duplicate 'extern' declaration specifier [-Wduplicate-decl-specifier]
ListUtil.c:2508:1: warning: duplicate 'extern' declaration specifier [-Wduplicate-decl-specifier]
Base64.xs:183:2: warning: 'register' storage class specifier is deprecated and incompatible with C++17 [-Wdeprecated-register]
Base64.xs:279:2: warning: 'register' storage class specifier is deprecated and incompatible with C++17 [-Wdeprecated-register]
Base64.c:722:1: warning: duplicate 'extern' declaration specifier [-Wduplicate-decl-specifier]
FastCalc.c:628:1: warning: duplicate 'extern' declaration specifier [-Wduplicate-decl-specifier]
NDBM_File.c:601:1: warning: duplicate 'extern' declaration specifier [-Wduplicate-decl-specifier]
Opcode.c:868:1: warning: duplicate 'extern' declaration specifier [-Wduplicate-decl-specifier]
POSIX.xs:3230:38: warning: variable 'wc' is uninitialized when used here [-Wuninitialized]
../../embed.h:668:51: note: expanded from macro 'sv_setiv_mg'
POSIX.xs:3218:23: note: initialize the variable 'wc' to silence this warning
POSIX.c:5469:1: warning: duplicate 'extern' declaration specifier [-Wduplicate-decl-specifier]
encoding.c:801:1: warning: duplicate 'extern' declaration specifier [-Wduplicate-decl-specifier]
mmap.c:448:1: warning: duplicate 'extern' declaration specifier [-Wduplicate-decl-specifier]
scalar.c:601:1: warning: duplicate 'extern' declaration specifier [-Wduplicate-decl-specifier]
via.c:843:1: warning: duplicate 'extern' declaration specifier [-Wduplicate-decl-specifier]
SDBM_File.c:583:1: warning: duplicate 'extern' declaration specifier [-Wduplicate-decl-specifier]
Socket.xs:769:28: warning: missing field 'ai_family' initializer [-Wmissing-field-initializers]
Socket.c:1869:1: warning: duplicate 'extern' declaration specifier [-Wduplicate-decl-specifier]
Storable.c:8164:1: warning: duplicate 'extern' declaration specifier [-Wduplicate-decl-specifier]
Hostname.c:243:1: warning: duplicate 'extern' declaration specifier [-Wduplicate-decl-specifier]
Syslog.c:532:1: warning: duplicate 'extern' declaration specifier [-Wduplicate-decl-specifier]
HiRes.c:2182:1: warning: duplicate 'extern' declaration specifier [-Wduplicate-decl-specifier]
Piece.c:1505:1: warning: duplicate 'extern' declaration specifier [-Wduplicate-decl-specifier]
Collate.c:1088:1: warning: duplicate 'extern' declaration specifier [-Wduplicate-decl-specifier]
Normalize.c:1289:1: warning: duplicate 'extern' declaration specifier [-Wduplicate-decl-specifier]
APItest.c:3287:2: warning: 'Perl_ptr_table_clear' is deprecated [-Wdeprecated-declarations]
../../embed.h:458:28: note: expanded from macro 'ptr_table_clear'
../../proto.h:2793:4: note: 'Perl_ptr_table_clear' has been explicitly marked deprecated here
../../perl.h:340:60: note: expanded from macro '__attribute__deprecated__'
APItest.c:14064:1: warning: duplicate 'extern' declaration specifier [-Wduplicate-decl-specifier]
XSUB-undef-XS_VERSION.c:194:1: warning: duplicate 'extern' declaration specifier [-Wduplicate-decl-specifier]
XSUB-redefined-macros.c:216:1: warning: duplicate 'extern' declaration specifier [-Wduplicate-decl-specifier]
Typemap.c:1919:1: warning: duplicate 'extern' declaration specifier [-Wduplicate-decl-specifier]
attributes.c:465:1: warning: duplicate 'extern' declaration specifier [-Wduplicate-decl-specifier]
mro.c:929:1: warning: duplicate 'extern' declaration specifier [-Wduplicate-decl-specifier]
re_exec.c:2977:35: warning: converting the result of '?:' with integer constants to a boolean always evaluates to 'true' [-Wtautological-constant-compare]
../../regcharclass.h:58:4: note: expanded from macro 'is_LNBREAK_utf8_safe'
../../regcharclass.h:65:4: note: expanded from macro 'is_LNBREAK_utf8_safe'
re_exec.c:2982:32: warning: converting the result of '?:' with integer constants to a boolean always evaluates to 'true' [-Wtautological-constant-compare]
../../regcharclass.h:76:4: note: expanded from macro 'is_LNBREAK_latin1_safe'
re_comp.c:8219:37: warning: result of comparison against a string literal is unspecified (use an explicit string comparison function instead) [-Wstring-compare]
../../scope.h:212:25: note: expanded from macro 'LEAVE_with_name'
/usr/include/assert.h:56:21: note: expanded from macro 'assert'
re_comp.c:6647:13: note: expanded from macro 'CHECK_RESTUDY_GOTO_butfirst'
re_comp.c:8267:2: warning: result of comparison against a string literal is unspecified (use an explicit string comparison function instead) [-Wstring-compare]
re_comp.c:10643:13: warning: converting the result of '?:' with integer constants to a boolean always evaluates to 'true' [-Wtautological-constant-compare]
../../regcharclass.h:917:8: note: expanded from macro 'is_MULTI_CHAR_FOLD_latin1_safe'
re_comp.c:10727:13: warning: converting the result of '?:' with integer constants to a boolean always evaluates to 'true' [-Wtautological-constant-compare]
../../regcharclass.h:420:49: note: expanded from macro 'is_MULTI_CHAR_FOLD_utf8_safe'
../../regcharclass.h:247:8: note: expanded from macro 'is_MULTI_CHAR_FOLD_utf8_safe_part0_'
../../regcharclass.h:420:92: note: expanded from macro 'is_MULTI_CHAR_FOLD_utf8_safe'
../../regcharclass.h:279:9: note: expanded from macro 'is_MULTI_CHAR_FOLD_utf8_safe_part1_'
../../regcharclass.h:302:6: note: expanded from macro 'is_MULTI_CHAR_FOLD_utf8_safe_part1_'
../../regcharclass.h:303:9: note: expanded from macro 'is_MULTI_CHAR_FOLD_utf8_safe_part1_'
../../regcharclass.h:309:9: note: expanded from macro 'is_MULTI_CHAR_FOLD_utf8_safe_part1_'
../../regcharclass.h:426:8: note: expanded from macro 'is_MULTI_CHAR_FOLD_utf8_safe'
../../regcharclass.h:479:19: note: expanded from macro 'is_MULTI_CHAR_FOLD_utf8_safe'
../../regcharclass.h:332:8: note: expanded from macro 'is_MULTI_CHAR_FOLD_utf8_safe_part2_'
../../regcharclass.h:479:62: note: expanded from macro 'is_MULTI_CHAR_FOLD_utf8_safe'
../../regcharclass.h:390:8: note: expanded from macro 'is_MULTI_CHAR_FOLD_utf8_safe_part3_'
re_comp.c:15197:37: warning: converting the result of '?:' with integer constants to a boolean always evaluates to 'true' [-Wtautological-constant-compare]
../../regcharclass.h:994:4: note: expanded from macro 'is_THREE_CHAR_FOLD_HEAD_utf8_safe'
../../regcharclass.h:1002:8: note: expanded from macro 'is_THREE_CHAR_FOLD_HEAD_utf8_safe'
../../regcharclass.h:1004:8: note: expanded from macro 'is_THREE_CHAR_FOLD_HEAD_utf8_safe'
../../regcharclass.h:1009:8: note: expanded from macro 'is_THREE_CHAR_FOLD_HEAD_utf8_safe'
../../regcharclass.h:1011:8: note: expanded from macro 'is_THREE_CHAR_FOLD_HEAD_utf8_safe'
../../regcharclass.h:1023:4: note: expanded from macro 'is_THREE_CHAR_FOLD_HEAD_utf8_safe'
../../regcharclass.h:1042:4: note: expanded from macro 'is_THREE_CHAR_FOLD_HEAD_utf8_safe'
re_comp.c:15248:38: warning: converting the result of '?:' with integer constants to a boolean always evaluates to 'true' [-Wtautological-constant-compare]
re_comp.c:15296:37: warning: converting the result of '?:' with integer constants to a boolean always evaluates to 'true' [-Wtautological-constant-compare]
../../regcharclass.h:1066:4: note: expanded from macro 'is_THREE_CHAR_FOLD_HEAD_latin1_safe'
re_comp.c:15317:38: warning: converting the result of '?:' with integer constants to a boolean always evaluates to 'true' [-Wtautological-constant-compare]
re.c:434:1: warning: duplicate 'extern' declaration specifier [-Wduplicate-decl-specifier]
threads.c:2193:1: warning: duplicate 'extern' declaration specifier [-Wduplicate-decl-specifier]
shared.c:2147:1: warning: duplicate 'extern' declaration specifier [-Wduplicate-decl-specifier]
ExtTest.c:660:1: warning: duplicate 'extern' declaration specifier [-Wduplicate-decl-specifier]
../../../../XSUB.h:146:29: note: expanded from macro 'XS_EXTERNAL'
ExtTest.c:356:1: warning: duplicate 'extern' declaration specifier [-Wduplicate-decl-specifier]
ExtTest.c:442:1: warning: duplicate 'extern' declaration specifier [-Wduplicate-decl-specifier]
ExtTest.c:376:1: warning: duplicate 'extern' declaration specifier [-Wduplicate-decl-specifier]
ExtTest.c:460:1: warning: duplicate 'extern' declaration specifier [-Wduplicate-decl-specifier]
ExtTest.c:441:1: warning: duplicate 'extern' declaration specifier [-Wduplicate-decl-specifier]
ExtTest.c:417:1: warning: duplicate 'extern' declaration specifier [-Wduplicate-decl-specifier]
XSTest.c:340:1: warning: duplicate 'extern' declaration specifier [-Wduplicate-decl-specifier]
/usr/home/core/smoke/perl-current/XSUB.h:146:29: note: expanded from macro 'XS_EXTERNAL'
XSMore.c:525:1: warning: duplicate 'extern' declaration specifier [-Wduplicate-decl-specifier]
XSUsage.c:301:1: warning: duplicate 'extern' declaration specifier [-Wduplicate-decl-specifier]
toke.c:4327:5: warning: result of comparison against a string literal is unspecified (use an explicit string comparison function instead) [-Wstring-compare]
./scope.h:212:25: note: expanded from macro 'LEAVE_with_name'
toke.c:6277:20: warning: result of comparison against a string literal is unspecified (use an explicit string comparison function instead) [-Wstring-compare]
toke.c:12106:3: warning: result of comparison against a string literal is unspecified (use an explicit string comparison function instead) [-Wstring-compare]
regcomp.c:8219:37: warning: result of comparison against a string literal is unspecified (use an explicit string comparison function instead) [-Wstring-compare]
regcomp.c:6647:13: note: expanded from macro 'CHECK_RESTUDY_GOTO_butfirst'
regcomp.c:8267:2: warning: result of comparison against a string literal is unspecified (use an explicit string comparison function instead) [-Wstring-compare]
./inline.h:180:13: warning: format specifies type 'void *' but the argument has type 'long' [-Wformat]
./perl.h:4696:22: note: expanded from macro 'DEBUG_v'
./perl.h:4667:17: note: expanded from macro 'DEBUG__'
./perl.h:1118:69: note: expanded from macro 'DEBUG_PRE_STMTS'
./perl.h:1103:23: note: expanded from macro 'PRE_aTHX_'
/usr/include/sys/_null.h:39:14: note: expanded from macro 'NULL'
./perl.h:4616:40: note: expanded from macro 'DEBUG_s'
./inline.h:190:13: warning: format specifies type 'void *' but the argument has type 'long' [-Wformat]
./inline.h:2577:13: warning: format specifies type 'void *' but the argument has type 'long' [-Wformat]
./perl.h:4702:22: note: expanded from macro 'DEBUG_L'
pp_hot.c:192:17: warning: result of comparison against a string literal is unspecified (use an explicit string comparison function instead) [-Wstring-compare]
pp_hot.c:4562:5: warning: result of comparison against a string literal is unspecified (use an explicit string comparison function instead) [-Wstring-compare]
pp_hot.c:4569:9: warning: result of comparison against a string literal is unspecified (use an explicit string comparison function instead) [-Wstring-compare]
sv.c:525:13: warning: format specifies type 'void *' but the argument has type 'long' [-Wformat]
./perl.h:4686:22: note: expanded from macro 'DEBUG_D'
sv.c:557:9: warning: format specifies type 'void *' but the argument has type 'long' [-Wformat]
sv.c:563:9: warning: format specifies type 'void *' but the argument has type 'long' [-Wformat]
sv.c:569:9: warning: format specifies type 'void *' but the argument has type 'long' [-Wformat]
sv.c:575:9: warning: format specifies type 'void *' but the argument has type 'long' [-Wformat]
sv.c:597:9: warning: format specifies type 'void *' but the argument has type 'long' [-Wformat]
sv.c:657:5: warning: format specifies type 'void *' but the argument has type 'long' [-Wformat]
sv.c:4675:21: warning: format specifies type 'void *' but the argument has type 'long' [-Wformat]
./perl.h:4697:22: note: expanded from macro 'DEBUG_C'
sv.c:4842:13: warning: format specifies type 'void *' but the argument has type 'long' [-Wformat]
sv.c:4853:9: warning: format specifies type 'void *' but the argument has type 'long' [-Wformat]
sv.c:6985:17: warning: format specifies type 'void *' but the argument has type 'long' [-Wformat]
./pp.h:75:17: note: expanded from macro 'PUSHMARK'
sv.c:8739:9: warning: format specifies type 'void *' but the argument has type 'long' [-Wformat]
./perl.h:4689:23: note: expanded from macro 'DEBUG_Pv'
sv.c:8758:9: warning: format specifies type 'void *' but the argument has type 'long' [-Wformat]
sv.c:16092:9: warning: format specifies type 'void *' but the argument has type 'long' [-Wformat]
sv.c:16163:9: warning: format specifies type 'void *' but the argument has type 'long' [-Wformat]
pp.c:5787:2: warning: result of comparison against a string literal is unspecified (use an explicit string comparison function instead) [-Wstring-compare]
pp.c:5843:2: warning: result of comparison against a string literal is unspecified (use an explicit string comparison function instead) [-Wstring-compare]
pp.c:6431:13: warning: result of comparison against a string literal is unspecified (use an explicit string comparison function instead) [-Wstring-compare]
pp_ctl.c:1109:5: warning: result of comparison against a string literal is unspecified (use an explicit string comparison function instead) [-Wstring-compare]
pp_ctl.c:1115:9: warning: result of comparison against a string literal is unspecified (use an explicit string comparison function instead) [-Wstring-compare]
pp_ctl.c:3597:5: warning: result of comparison against a string literal is unspecified (use an explicit string comparison function instead) [-Wstring-compare]
pp_ctl.c:4118:21: warning: result of comparison against a string literal is unspecified (use an explicit string comparison function instead) [-Wstring-compare]
pp_ctl.c:4831:5: warning: result of comparison against a string literal is unspecified (use an explicit string comparison function instead) [-Wstring-compare]
pp_ctl.c:4930:17: warning: result of comparison against a string literal is unspecified (use an explicit string comparison function instead) [-Wstring-compare]
pp_ctl.c:4962:17: warning: result of comparison against a string literal is unspecified (use an explicit string comparison function instead) [-Wstring-compare]
pp_ctl.c:4984:13: warning: result of comparison against a string literal is unspecified (use an explicit string comparison function instead) [-Wstring-compare]
pp_ctl.c:5830:9: warning: result of comparison against a string literal is unspecified (use an explicit string comparison function instead) [-Wstring-compare]
pp_sys.c:312:13: warning: result of comparison against a string literal is unspecified (use an explicit string comparison function instead) [-Wstring-compare]
pp_sys.c:397:5: warning: result of comparison against a string literal is unspecified (use an explicit string comparison function instead) [-Wstring-compare]
pp_sys.c:586:5: warning: result of comparison against a string literal is unspecified (use an explicit string comparison function instead) [-Wstring-compare]
pp_sys.c:989:5: warning: result of comparison against a string literal is unspecified (use an explicit string comparison function instead) [-Wstring-compare]
pp_sys.c:1024:16: warning: result of comparison against a string literal is unspecified (use an explicit string comparison function instead) [-Wstring-compare]
numeric.c:1512:17: warning: format specifies type 'void *' but the argument has type 'long' [-Wformat]
./perl.h:7130:13: note: expanded from macro 'SET_NUMERIC_STANDARD'
./perl.h:4690:23: note: expanded from macro 'DEBUG_Lv'
./perl.h:7136:13: note: expanded from macro 'SET_NUMERIC_STANDARD'
numeric.c:1513:17: warning: format specifies type 'void *' but the argument has type 'long' [-Wformat]
./perl.h:7175:13: note: expanded from macro 'LOCK_LC_NUMERIC_STANDARD'
numeric.c:1519:17: warning: format specifies type 'void *' but the argument has type 'long' [-Wformat]
./perl.h:7190:13: note: expanded from macro 'UNLOCK_LC_NUMERIC_STANDARD'
locale.c:1643:5: warning: format specifies type 'void *' but the argument has type 'long' [-Wformat]
locale.c:1769:5: warning: format specifies type 'void *' but the argument has type 'long' [-Wformat]
locale.c:1812:5: warning: format specifies type 'void *' but the argument has type 'long' [-Wformat]
locale.c:1884:5: warning: format specifies type 'void *' but the argument has type 'long' [-Wformat]
locale.c:1912:5: warning: format specifies type 'void *' but the argument has type 'long' [-Wformat]
locale.c:1959:5: warning: format specifies type 'void *' but the argument has type 'long' [-Wformat]
locale.c:1989:5: warning: format specifies type 'void *' but the argument has type 'long' [-Wformat]
locale.c:2092:21: warning: format specifies type 'void *' but the argument has type 'long' [-Wformat]
locale.c:2100:13: warning: format specifies type 'void *' but the argument has type 'long' [-Wformat]
locale.c:2106:13: warning: format specifies type 'void *' but the argument has type 'long' [-Wformat]
locale.c:2129:9: warning: format specifies type 'void *' but the argument has type 'long' [-Wformat]
locale.c:2140:5: warning: format specifies type 'void *' but the argument has type 'long' [-Wformat]
locale.c:2187:21: warning: format specifies type 'void *' but the argument has type 'long' [-Wformat]
locale.c:2193:21: warning: format specifies type 'void *' but the argument has type 'long' [-Wformat]
locale.c:2199:21: warning: format specifies type 'void *' but the argument has type 'long' [-Wformat]
locale.c:2205:21: warning: format specifies type 'void *' but the argument has type 'long' [-Wformat]
locale.c:2211:21: warning: format specifies type 'void *' but the argument has type 'long' [-Wformat]
locale.c:2217:21: warning: format specifies type 'void *' but the argument has type 'long' [-Wformat]
locale.c:2223:21: warning: format specifies type 'void *' but the argument has type 'long' [-Wformat]
locale.c:2229:21: warning: format specifies type 'void *' but the argument has type 'long' [-Wformat]
locale.c:2235:21: warning: format specifies type 'void *' but the argument has type 'long' [-Wformat]
locale.c:2241:21: warning: format specifies type 'void *' but the argument has type 'long' [-Wformat]
locale.c:2247:21: warning: format specifies type 'void *' but the argument has type 'long' [-Wformat]
locale.c:2253:21: warning: format specifies type 'void *' but the argument has type 'long' [-Wformat]
locale.c:2259:21: warning: format specifies type 'void *' but the argument has type 'long' [-Wformat]
locale.c:2280:13: warning: format specifies type 'void *' but the argument has type 'long' [-Wformat]
locale.c:2422:9: warning: format specifies type 'void *' but the argument has type 'long' [-Wformat]
locale.c:2681:5: warning: format specifies type 'void *' but the argument has type 'long' [-Wformat]
locale.c:2698:13: warning: format specifies type 'void *' but the argument has type 'long' [-Wformat]
locale.c:2734:9: warning: format specifies type 'void *' but the argument has type 'long' [-Wformat]
locale.c:2751:9: warning: format specifies type 'void *' but the argument has type 'long' [-Wformat]
locale.c:2763:9: warning: format specifies type 'void *' but the argument has type 'long' [-Wformat]
locale.c:2785:5: warning: format specifies type 'void *' but the argument has type 'long' [-Wformat]
locale.c:2843:9: warning: format specifies type 'void *' but the argument has type 'long' [-Wformat]
locale.c:2899:5: warning: format specifies type 'void *' but the argument has type 'long' [-Wformat]
locale.c:4233:5: warning: format specifies type 'void *' but the argument has type 'long' [-Wformat]
locale.c:4918:5: warning: format specifies type 'void *' but the argument has type 'long' [-Wformat]
locale.c:5335:9: warning: format specifies type 'void *' but the argument has type 'long' [-Wformat]
locale.c:5083:9: note: expanded from macro 'DEBUG_LOCALE_INIT'
locale.c:5360:17: warning: format specifies type 'void *' but the argument has type 'long' [-Wformat]
locale.c:5548:17: warning: format specifies type 'void *' but the argument has type 'long' [-Wformat]
locale.c:5751:9: warning: format specifies type 'void *' but the argument has type 'long' [-Wformat]
locale.c:5790:5: warning: format specifies type 'void *' but the argument has type 'long' [-Wformat]
locale.c:5841:9: warning: format specifies type 'void *' but the argument has type 'long' [-Wformat]
locale.c:5875:13: warning: format specifies type 'void *' but the argument has type 'long' [-Wformat]
locale.c:5953:17: warning: format specifies type 'void *' but the argument has type 'long' [-Wformat]
locale.c:5958:17: warning: format specifies type 'void *' but the argument has type 'long' [-Wformat]
locale.c:5964:13: warning: format specifies type 'void *' but the argument has type 'long' [-Wformat]
locale.c:6102:25: warning: format specifies type 'void *' but the argument has type 'long' [-Wformat]
locale.c:6109:21: warning: format specifies type 'void *' but the argument has type 'long' [-Wformat]
locale.c:6169:9: warning: format specifies type 'void *' but the argument has type 'long' [-Wformat]
locale.c:6229:17: warning: format specifies type 'void *' but the argument has type 'long' [-Wformat]
locale.c:6259:17: warning: format specifies type 'void *' but the argument has type 'long' [-Wformat]
locale.c:6284:21: warning: format specifies type 'void *' but the argument has type 'long' [-Wformat]
locale.c:6294:21: warning: format specifies type 'void *' but the argument has type 'long' [-Wformat]
locale.c:6304:13: warning: format specifies type 'void *' but the argument has type 'long' [-Wformat]
locale.c:6331:13: warning: format specifies type 'void *' but the argument has type 'long' [-Wformat]
locale.c:6341:13: warning: format specifies type 'void *' but the argument has type 'long' [-Wformat]
locale.c:6351:5: warning: format specifies type 'void *' but the argument has type 'long' [-Wformat]
locale.c:6365:5: warning: format specifies type 'void *' but the argument has type 'long' [-Wformat]
locale.c:6508:5: warning: format specifies type 'void *' but the argument has type 'long' [-Wformat]
locale.c:6521:9: warning: format specifies type 'void *' but the argument has type 'long' [-Wformat]
locale.c:6532:5: warning: format specifies type 'void *' but the argument has type 'long' [-Wformat]
locale.c:6550:9: warning: format specifies type 'void *' but the argument has type 'long' [-Wformat]
locale.c:6555:5: warning: format specifies type 'void *' but the argument has type 'long' [-Wformat]
locale.c:6614:5: warning: format specifies type 'void *' but the argument has type 'long' [-Wformat]
locale.c:6623:5: warning: format specifies type 'void *' but the argument has type 'long' [-Wformat]
locale.c:6897:5: warning: format specifies type 'void *' but the argument has type 'long' [-Wformat]
locale.c:6658:5: note: expanded from macro 'DEBUG_STRERROR_ENTER'
locale.c:6915:5: warning: format specifies type 'void *' but the argument has type 'long' [-Wformat]
locale.c:6664:5: note: expanded from macro 'DEBUG_STRERROR_RETURN'
locale.c:6987:5: warning: format specifies type 'void *' but the argument has type 'long' [-Wformat]
locale.c:7202:49: warning: format specifies type 'char *' but the argument has type 'int' [-Wformat]
locale.c:7203:22: warning: format specifies type 'int' but the argument has type 'const char *' [-Wformat]
locale.c:7200:73: warning: more '%' conversions than data arguments [-Wformat]
locale.c:3157:1: warning: unused function 'S_lock_and_run_localeconv' [-Wunused-function]

Non-Fatal messages(gcc):



-- 
Report by Test::Smoke v1.71 running on perl 5.30.2
(Reporter v0.053 / Smoker v0.046)

Thread Previous


nntp.perl.org: Perl Programming lists via nntp and http.
Comments to Ask Bjørn Hansen at ask@perl.org | Group listing | About