develooper Front page | perl.daily-build.reports | Postings from May 2021

Smoke [smoke-me/khw-env] v5.33.8-335-gd2016003a3 PASS netbsd 9.1(amd64/1 cpu)

Thread Previous
From:
Carlos Guevara
Date:
May 3, 2021 12:38
Subject:
Smoke [smoke-me/khw-env] v5.33.8-335-gd2016003a3 PASS netbsd 9.1(amd64/1 cpu)
Message ID:
20210503123741.BEA0B3987E6@cjg-netbsd9
Automated smoke report for branch smoke-me/khw-env 5.33.9 patch d2016003a30e82b7141d899fe3a6a263d090471d v5.33.8-335-gd2016003a3
cjg-netbsd9: Intel 686-class (amd64/1 cpu)
    on        netbsd - 9.1
    using     gcc version 7.5.0
    smoketime 5 hours 20 minutes (average 40 minutes 5 seconds)

Summary: PASS

O = OK  F = Failure(s), extended report at the bottom
X = Failure(s) under TEST but not under harness
? = still running or test results not (yet) available
Build failures during:       - = unknown or N/A
c = Configure, m = make, M = make (after miniperl), t = make test-prep

v5.33.8-335-gd2016003a3  Configuration (common) -Dcc=gcc
----------- ---------------------------------------------------------
O O         
O O         -Duse64bitall
O O         -Duseithreads
O O         -Duseithreads -Duse64bitall
| +--------- -DDEBUGGING
+----------- no debugging


Testsuite was run only with 'harness'

Tests skipped on user request:
    # One test name on a line
MANIFEST did not declare '.mailmap'

Compiler messages(gcc):
locale.c:1651:1: warning: 'S_get_LC_ALL_display' defined but not used [-Wunused-function]
locale.c:1534:1: warning: 'S_calculate_LC_ALL' defined but not used [-Wunused-function]
locale.c:169:19: warning: 'C_codeset' defined but not used [-Wunused-const-variable=]
/usr/include/sys/cdefs_elf.h:67:20: error: missing binary operator before token "("
/usr/include/sys/cdefs_elf.h:73:20: error: missing binary operator before token "("
/usr/include/sys/cdefs_elf.h:79:20: error: missing binary operator before token "("
DB_File.xs: In function 'ParseOpenInfo':
DB_File.xs:476:44: warning: suggest braces around empty body in an 'if' statement [-Wempty-body]
DB_File.xs:1044:13: note: in expansion of macro 'croak_and_free'
DB_File.xs:1050:13: note: in expansion of macro 'croak_and_free'
DB_File.xs:1056:17: note: in expansion of macro 'croak_and_free'
DB_File.xs:1091:17: note: in expansion of macro 'croak_and_free'
DB_File.xs:1140:17: note: in expansion of macro 'croak_and_free'
DB_File.xs:1229:13: note: in expansion of macro 'croak_and_free'
Socket.c: In function 'XS_Socket_pack_ip_mreq_source':
Socket.c:1694:7: warning: variable 'interface' set but not used [-Wunused-but-set-variable]
const-c.inc: In function 'constant_19':
const-c.inc:351:42: warning: unused parameter 'iv_return' [-Wunused-parameter]
Piece.xs: In function '_strptime':
Piece.xs:751:8: warning: 'len' may be used uninitialized in this function [-Wmaybe-uninitialized]
re_exec.c: In function 'S_regtry':
re_exec.c:7063:30: warning: 'fold_array' may be used uninitialized in this function [-Wmaybe-uninitialized]
re_exec.c:6967:17: note: 'fold_array' was declared here
re_exec.c:7069:22: warning: 'folder' may be used uninitialized in this function [-Wmaybe-uninitialized]
re_exec.c:6966:16: note: 'folder' was declared here
regexec.c: In function 'S_regtry':
regexec.c:7063:30: warning: 'fold_array' may be used uninitialized in this function [-Wmaybe-uninitialized]
regexec.c:6967:17: note: 'fold_array' was declared here
regexec.c:7069:22: warning: 'folder' may be used uninitialized in this function [-Wmaybe-uninitialized]
regexec.c:6966:16: note: 'folder' was declared here
locale.c: In function 'S_my_langinfo_i':
locale.c:4234:28: warning: format '%d' expects argument of type 'int', but argument 3 has type 'nl_item {aka const long int}' [-Wformat=]
perl.h:4667:33: note: in definition of macro 'DEBUG__'
locale.c:4233:5: note: in expansion of macro 'DEBUG_Lv'
locale.c: In function 'S_my_setlocale_debug_string_i':
locale.c:7200:44: warning: format '%s' expects argument of type 'char *', but argument 5 has type 'int' [-Wformat=]
locale.c:7200:47: warning: format '%d' expects argument of type 'int', but argument 6 has type 'const char *' [-Wformat=]
locale.c:7200:73: warning: format '%s' expects a matching 'char *' argument [-Wformat=]
locale.c:643:1: warning: 'S_less_dicey_bool_setlocale_r' defined but not used [-Wunused-function]

Non-Fatal messages(gcc):



-- 
Report by Test::Smoke v1.71 running on perl 5.30.2
(Reporter v0.053 / Smoker v0.046)

Thread Previous


nntp.perl.org: Perl Programming lists via nntp and http.
Comments to Ask Bjørn Hansen at ask@perl.org | Group listing | About