develooper Front page | perl.daily-build.reports | Postings from May 2021

Smoke [smoke-me/khw-locale] v5.33.8-335-g292f901050 FAIL(Fm) freebsd13.0-RELEASE (amd64/1 cpu)

From:
Carlos Guevara
Date:
May 3, 2021 09:54
Subject:
Smoke [smoke-me/khw-locale] v5.33.8-335-g292f901050 FAIL(Fm) freebsd13.0-RELEASE (amd64/1 cpu)
Message ID:
202105030953.1439rbHQ016352@cjg-freebsd13
Automated smoke report for branch smoke-me/khw-locale 5.33.9 patch 292f9010500f47e44d447a874e1231aa8badfe6c v5.33.8-335-g292f901050
cjg-freebsd13: Intel(R) Xeon(R) CPU E5-2620 v2 @ 2.10GHz (amd64/1 cpu)
    on        freebsd - 13.0-RELEASE
    using     clang version FreeBSD Clang 11.0.1 (git@github.com:llvm/llvm-project.git llvmorg-11.0.1-0-g43ff75f2c3fe)
    smoketime 4 hours 10 minutes (average 20 minutes 54 seconds)

Summary: FAIL(Fm)

O = OK  F = Failure(s), extended report at the bottom
X = Failure(s) under TEST but not under harness
? = still running or test results not (yet) available
Build failures during:       - = unknown or N/A
c = Configure, m = make, M = make (after miniperl), t = make test-prep

v5.33.8-335-g292f901050  Configuration (common) -Dcc=clang
----------- ---------------------------------------------------------
m m         
m m         -Duse64bitall
m m         -Duselongdouble
F F         -Duseithreads
F F         -Duseithreads -Duse64bitall
F F         -Duseithreads -Duselongdouble
| +--------- -DDEBUGGING
+----------- no debugging


Testsuite was run only with 'harness'

Tests skipped on user request:
    # One test name on a line
Failures: (common-args) -Dcc=clang
[default] -Duseithreads
[default] -DDEBUGGING -Duseithreads
[default] -DDEBUGGING -Duseithreads -Duse64bitall
[default] -DDEBUGGING -Duseithreads -Duselongdouble
../t/run/locale.t...........................................FAILED
    10

[default] -Duseithreads -Duse64bitall
[default] -Duseithreads -Duselongdouble
../t/run/locale.t...........................................FAILED
    10
../lib/locale_threads.t.....................................FAILED
    2

MANIFEST did not declare '.mailmap'

Passed Todo tests: (common-args) -Dcc=clang
[default] -Duseithreads
[default] -DDEBUGGING -Duseithreads
[default] -Duseithreads -Duse64bitall
[default] -DDEBUGGING -Duseithreads -Duse64bitall
[default] -Duseithreads -Duselongdouble
[default] -DDEBUGGING -Duseithreads -Duselongdouble
../dist/Net-Ping/t/010_pingecho.t...........................PASSED
    2
../dist/Net-Ping/t/450_service.t............................PASSED
    9, 18

Compiler messages(gcc):
locale.c:3613:18: warning: implicit declaration of function 'S_lock_and_run_localeconv' [-Wimplicit-function-declaration]
locale.c:3613:16: warning: incompatible integer to pointer conversion assigning to 'HV *' (aka 'struct hv *') from 'int' [-Wint-conversion]
locale.c:1534:1: warning: unused function 'S_calculate_LC_ALL' [-Wunused-function]
locale.c:1651:1: warning: unused function 'S_get_LC_ALL_display' [-Wunused-function]
locale.c:169:19: warning: unused variable 'C_codeset' [-Wunused-const-variable]
toke.c:4327:5: warning: result of comparison against a string literal is unspecified (use an explicit string comparison function instead) [-Wstring-compare]
./scope.h:212:25: note: expanded from macro 'LEAVE_with_name'
/usr/include/assert.h:56:21: note: expanded from macro 'assert'
toke.c:6277:20: warning: result of comparison against a string literal is unspecified (use an explicit string comparison function instead) [-Wstring-compare]
toke.c:12106:3: warning: result of comparison against a string literal is unspecified (use an explicit string comparison function instead) [-Wstring-compare]
regcomp.c:8219:37: warning: result of comparison against a string literal is unspecified (use an explicit string comparison function instead) [-Wstring-compare]
regcomp.c:6647:13: note: expanded from macro 'CHECK_RESTUDY_GOTO_butfirst'
regcomp.c:8267:2: warning: result of comparison against a string literal is unspecified (use an explicit string comparison function instead) [-Wstring-compare]
pp_hot.c:192:17: warning: result of comparison against a string literal is unspecified (use an explicit string comparison function instead) [-Wstring-compare]
pp_hot.c:4562:5: warning: result of comparison against a string literal is unspecified (use an explicit string comparison function instead) [-Wstring-compare]
pp_hot.c:4569:9: warning: result of comparison against a string literal is unspecified (use an explicit string comparison function instead) [-Wstring-compare]
pp.c:5787:2: warning: result of comparison against a string literal is unspecified (use an explicit string comparison function instead) [-Wstring-compare]
pp.c:5843:2: warning: result of comparison against a string literal is unspecified (use an explicit string comparison function instead) [-Wstring-compare]
pp.c:6431:13: warning: result of comparison against a string literal is unspecified (use an explicit string comparison function instead) [-Wstring-compare]
pp_ctl.c:1109:5: warning: result of comparison against a string literal is unspecified (use an explicit string comparison function instead) [-Wstring-compare]
pp_ctl.c:1115:9: warning: result of comparison against a string literal is unspecified (use an explicit string comparison function instead) [-Wstring-compare]
pp_ctl.c:3597:5: warning: result of comparison against a string literal is unspecified (use an explicit string comparison function instead) [-Wstring-compare]
pp_ctl.c:4118:21: warning: result of comparison against a string literal is unspecified (use an explicit string comparison function instead) [-Wstring-compare]
pp_ctl.c:4831:5: warning: result of comparison against a string literal is unspecified (use an explicit string comparison function instead) [-Wstring-compare]
pp_ctl.c:4930:17: warning: result of comparison against a string literal is unspecified (use an explicit string comparison function instead) [-Wstring-compare]
pp_ctl.c:4962:17: warning: result of comparison against a string literal is unspecified (use an explicit string comparison function instead) [-Wstring-compare]
pp_ctl.c:4984:13: warning: result of comparison against a string literal is unspecified (use an explicit string comparison function instead) [-Wstring-compare]
pp_ctl.c:5830:9: warning: result of comparison against a string literal is unspecified (use an explicit string comparison function instead) [-Wstring-compare]
pp_sys.c:312:13: warning: result of comparison against a string literal is unspecified (use an explicit string comparison function instead) [-Wstring-compare]
pp_sys.c:397:5: warning: result of comparison against a string literal is unspecified (use an explicit string comparison function instead) [-Wstring-compare]
pp_sys.c:586:5: warning: result of comparison against a string literal is unspecified (use an explicit string comparison function instead) [-Wstring-compare]
pp_sys.c:989:5: warning: result of comparison against a string literal is unspecified (use an explicit string comparison function instead) [-Wstring-compare]
pp_sys.c:1024:16: warning: result of comparison against a string literal is unspecified (use an explicit string comparison function instead) [-Wstring-compare]
locale.c:7243:49: warning: format specifies type 'char *' but the argument has type 'int' [-Wformat]
locale.c:7244:22: warning: format specifies type 'int' but the argument has type 'const char *' [-Wformat]
locale.c:7241:73: warning: more '%' conversions than data arguments [-Wformat]
POSIX.xs:3230:38: warning: variable 'wc' is uninitialized when used here [-Wuninitialized]
../../embed.h:668:51: note: expanded from macro 'sv_setiv_mg'
POSIX.xs:3218:23: note: initialize the variable 'wc' to silence this warning
re_comp.c:8219:37: warning: result of comparison against a string literal is unspecified (use an explicit string comparison function instead) [-Wstring-compare]
../../scope.h:212:25: note: expanded from macro 'LEAVE_with_name'
re_comp.c:6647:13: note: expanded from macro 'CHECK_RESTUDY_GOTO_butfirst'
re_comp.c:8267:2: warning: result of comparison against a string literal is unspecified (use an explicit string comparison function instead) [-Wstring-compare]

Non-Fatal messages(gcc):



-- 
Report by Test::Smoke v1.71 running on perl 5.30.2
(Reporter v0.053 / Smoker v0.046)



nntp.perl.org: Perl Programming lists via nntp and http.
Comments to Ask Bjørn Hansen at ask@perl.org | Group listing | About