develooper Front page | perl.daily-build.reports | Postings from April 2021

Smoke [smoke-me/khw-locale] v5.33.8-238-g7fd5cc1079 FAIL(F) netbsd9.1 (amd64/1 cpu)

From:
Carlos Guevara
Date:
April 6, 2021 06:09
Subject:
Smoke [smoke-me/khw-locale] v5.33.8-238-g7fd5cc1079 FAIL(F) netbsd9.1 (amd64/1 cpu)
Message ID:
20210406060857.64D643987CE@cjg-netbsd9
Automated smoke report for branch smoke-me/khw-locale 5.33.9 patch 7fd5cc107973635fca561d3b8014fbdbfd3ae711 v5.33.8-238-g7fd5cc1079
cjg-netbsd9: Intel 686-class (amd64/1 cpu)
    on        netbsd - 9.1
    using     g++ version 7.5.0
    smoketime 5 hours 26 minutes (average 40 minutes 50 seconds)

Summary: FAIL(F)

O = OK  F = Failure(s), extended report at the bottom
X = Failure(s) under TEST but not under harness
? = still running or test results not (yet) available
Build failures during:       - = unknown or N/A
c = Configure, m = make, M = make (after miniperl), t = make test-prep

v5.33.8-238-g7fd5cc1079  Configuration (common) -Dcc=g++
----------- ---------------------------------------------------------
O O         
O O         -Duse64bitall
F F         -Duseithreads
F F         -Duseithreads -Duse64bitall
| +--------- -DDEBUGGING
+----------- no debugging


Testsuite was run only with 'harness'

Tests skipped on user request:
    # One test name on a line
Failures: (common-args) -Dcc=g++
[default] -Duseithreads
[default] -DDEBUGGING -Duseithreads
[default] -Duseithreads -Duse64bitall
[default] -DDEBUGGING -Duseithreads -Duse64bitall
../cpan/version/t/07locale.t................................FAILED
    3
    Non-zero exit status: 1
../ext/I18N-Langinfo/t/Langinfo.t...........................FAILED
    93
    Non-zero exit status: 1

MANIFEST did not declare '.mailmap'

Compiler messages(gcc):
locale.c:1556:1: warning: 'const char* S_calculate_LC_ALL(const char**)' defined but not used [-Wunused-function]
/usr/include/sys/cdefs_elf.h:67:20: error: missing binary operator before token "("
/usr/include/sys/cdefs_elf.h:73:20: error: missing binary operator before token "("
/usr/include/sys/cdefs_elf.h:79:20: error: missing binary operator before token "("
inflate.c: In function 'int inflate(z_streamp, int)':
inflate.c:724:25: warning: this statement may fall through [-Wimplicit-fallthrough=]
inflate.c:725:9: note: here
inflate.c:732:25: warning: this statement may fall through [-Wimplicit-fallthrough=]
inflate.c:733:9: note: here
inflate.c:947:25: warning: this statement may fall through [-Wimplicit-fallthrough=]
inflate.c:948:9: note: here
inflate.c:968:25: warning: this statement may fall through [-Wimplicit-fallthrough=]
inflate.c:969:9: note: here
DB_File.xs: In function 'DB_File_type* ParseOpenInfo(int, char*, int, int, SV*)':
DB_File.xs:476:44: warning: suggest braces around empty body in an 'if' statement [-Wempty-body]
DB_File.xs:1044:13: note: in expansion of macro 'croak_and_free'
DB_File.xs:1050:13: note: in expansion of macro 'croak_and_free'
DB_File.xs:1056:17: note: in expansion of macro 'croak_and_free'
DB_File.xs:1091:17: note: in expansion of macro 'croak_and_free'
DB_File.xs:1140:17: note: in expansion of macro 'croak_and_free'
DB_File.xs:1229:13: note: in expansion of macro 'croak_and_free'
Socket.xs: In function 'void XS_Socket_inet_aton(CV*)':
Socket.xs:769:28: warning: missing initializer for member 'addrinfo::ai_family' [-Wmissing-field-initializers]
Socket.xs:769:28: warning: missing initializer for member 'addrinfo::ai_socktype' [-Wmissing-field-initializers]
Socket.xs:769:28: warning: missing initializer for member 'addrinfo::ai_protocol' [-Wmissing-field-initializers]
Socket.xs:769:28: warning: missing initializer for member 'addrinfo::ai_addrlen' [-Wmissing-field-initializers]
Socket.xs:769:28: warning: missing initializer for member 'addrinfo::ai_canonname' [-Wmissing-field-initializers]
Socket.xs:769:28: warning: missing initializer for member 'addrinfo::ai_addr' [-Wmissing-field-initializers]
Socket.xs:769:28: warning: missing initializer for member 'addrinfo::ai_next' [-Wmissing-field-initializers]
Socket.c: In function 'void XS_Socket_pack_ip_mreq_source(CV*)':
Socket.c:1694:7: warning: variable 'interface' set but not used [-Wunused-but-set-variable]
const-c.inc: In function 'int constant_19(const char*, IV*)':
const-c.inc:351:42: warning: unused parameter 'iv_return' [-Wunused-parameter]
HiRes.xs: In function 'void XS_Time__HiRes_setitimer(CV*)':
HiRes.xs:1248:42: warning: option '-Wc++-compat' is valid for C/ObjC but not for C++ [-Wpragmas]
HiRes.xs: In function 'void XS_Time__HiRes_getitimer(CV*)':
HiRes.xs:1268:42: warning: option '-Wc++-compat' is valid for C/ObjC but not for C++ [-Wpragmas]
Piece.xs: In function 'char* _strptime(const char*, const char*, tm*, int*)':
Piece.xs:751:8: warning: 'len' may be used uninitialized in this function [-Wmaybe-uninitialized]
re_exec.c: In function 'bool S_regtry(regmatch_info*, char**)':
re_exec.c:7063:39: warning: 'fold_array' may be used uninitialized in this function [-Wmaybe-uninitialized]
re_exec.c:6967:17: note: 'fold_array' was declared here
re_exec.c:7069:28: warning: 'folder' may be used uninitialized in this function [-Wmaybe-uninitialized]
re_exec.c:6966:16: note: 'folder' was declared here
regexec.c: In function 'bool S_regtry(regmatch_info*, char**)':
regexec.c:7063:39: warning: 'fold_array' may be used uninitialized in this function [-Wmaybe-uninitialized]
regexec.c:6967:17: note: 'fold_array' was declared here
regexec.c:7069:28: warning: 'folder' may be used uninitialized in this function [-Wmaybe-uninitialized]
regexec.c:6966:16: note: 'folder' was declared here
locale.c: In function 'const char* S_my_langinfo_i(nl_item, unsigned int, const char*, const char**, size_t*, int*)':
locale.c:3852:72: warning: format '%d' expects argument of type 'int', but argument 3 has type 'nl_item {aka long int}' [-Wformat=]
perl.h:4646:33: note: in definition of macro 'DEBUG__'
locale.c:3851:5: note: in expansion of macro 'DEBUG_Lv'
locale.c: In function 'char* S_my_setlocale_debug_string_i(unsigned int, const char*, const char*, line_t)':
locale.c:6679:44: warning: unused parameter 'line' [-Wunused-parameter]
../../embed.h: In function 'void XS_List__Util_reduce(CV*)':
../../embed.h:66:35: warning: 'retvals' may be used uninitialized in this function [-Wmaybe-uninitialized]
ListUtil.xs:530:9: note: 'retvals' was declared here
locale.c:1556:1: warning: 'const char* S_calculate_LC_ALL(PerlInterpreter*, const char**)' defined but not used [-Wunused-function]
locale.c:659:1: warning: 'bool S_less_dicey_bool_setlocale_r(PerlInterpreter*, int, const char*)' defined but not used [-Wunused-function]
DB_File.xs: In function 'DB_File_type* ParseOpenInfo(PerlInterpreter*, int, char*, int, int, SV*)':
Socket.xs: In function 'void XS_Socket_inet_aton(PerlInterpreter*, CV*)':
Socket.c: In function 'void XS_Socket_pack_ip_mreq_source(PerlInterpreter*, CV*)':
const-c.inc: In function 'int constant_19(PerlInterpreter*, const char*, IV*)':
HiRes.xs: In function 'void XS_Time__HiRes_setitimer(PerlInterpreter*, CV*)':
HiRes.xs: In function 'void XS_Time__HiRes_getitimer(PerlInterpreter*, CV*)':
Piece.xs: In function 'char* _strptime(PerlInterpreter*, const char*, const char*, tm*, int*)':
re_exec.c: In function 'bool S_regtry(PerlInterpreter*, regmatch_info*, char**)':
regexec.c: In function 'bool S_regtry(PerlInterpreter*, regmatch_info*, char**)':
locale.c: In function 'const char* S_my_langinfo_i(PerlInterpreter*, nl_item, unsigned int, const char*, const char**, size_t*, int*)':
locale.c: In function 'char* S_my_setlocale_debug_string_i(PerlInterpreter*, unsigned int, const char*, const char*, line_t)':
../../embed.h: In function 'void XS_List__Util_reduce(PerlInterpreter*, CV*)':

Non-Fatal messages(gcc):



-- 
Report by Test::Smoke v1.71 running on perl 5.30.2
(Reporter v0.053 / Smoker v0.046)



nntp.perl.org: Perl Programming lists via nntp and http.
Comments to Ask Bjørn Hansen at ask@perl.org | Group listing | About