develooper Front page | perl.daily-build.reports | Postings from April 2021

Smoke [smoke-me/khw-locale] v5.33.8-238-g68e7414e29 FAIL(F) netbsd8.2 (amd64/1 cpu)

From:
Carlos Guevara
Date:
April 5, 2021 22:55
Subject:
Smoke [smoke-me/khw-locale] v5.33.8-238-g68e7414e29 FAIL(F) netbsd8.2 (amd64/1 cpu)
Message ID:
20210405225532.98A2F26C04F@cjg-netbsd8
Automated smoke report for branch smoke-me/khw-locale 5.33.9 patch 68e7414e29e0adbdafe67a53fb96660bda0a7c2d v5.33.8-238-g68e7414e29
cjg-netbsd8: Intel 686-class (amd64/1 cpu)
    on        netbsd - 8.2
    using     gcc version 5.5.0
    smoketime 5 hours 31 minutes (average 41 minutes 30 seconds)

Summary: FAIL(F)

O = OK  F = Failure(s), extended report at the bottom
X = Failure(s) under TEST but not under harness
? = still running or test results not (yet) available
Build failures during:       - = unknown or N/A
c = Configure, m = make, M = make (after miniperl), t = make test-prep

v5.33.8-238-g68e7414e29  Configuration (common) -Dcc=gcc
----------- ---------------------------------------------------------
O O         
O O         -Duse64bitall
F F         -Duseithreads
F F         -Duseithreads -Duse64bitall
| +--------- -DDEBUGGING
+----------- no debugging


Testsuite was run only with 'harness'

Tests skipped on user request:
    # One test name on a line
Failures: (common-args) -Dcc=gcc
[default] -Duseithreads
[default] -DDEBUGGING -Duseithreads
[default] -Duseithreads -Duse64bitall
[default] -DDEBUGGING -Duseithreads -Duse64bitall
../cpan/version/t/07locale.t................................FAILED
    3
    Non-zero exit status: 1
../ext/I18N-Langinfo/t/Langinfo.t...........................FAILED
    93
    Non-zero exit status: 1

MANIFEST did not declare '.mailmap'

Compiler messages(gcc):
locale.c:1556:1: warning: 'S_calculate_LC_ALL' defined but not used [-Wunused-function]
/usr/include/sys/cdefs_elf.h:67:20: error: missing binary operator before token "("
/usr/include/sys/cdefs_elf.h:73:20: error: missing binary operator before token "("
/usr/include/sys/cdefs_elf.h:79:20: error: missing binary operator before token "("
DB_File.xs: In function 'ParseOpenInfo':
DB_File.xs:476:44: warning: suggest braces around empty body in an 'if' statement [-Wempty-body]
DB_File.xs:1044:13: note: in expansion of macro 'croak_and_free'
DB_File.xs:1050:13: note: in expansion of macro 'croak_and_free'
DB_File.xs:1056:17: note: in expansion of macro 'croak_and_free'
DB_File.xs:1091:17: note: in expansion of macro 'croak_and_free'
DB_File.xs:1140:17: note: in expansion of macro 'croak_and_free'
DB_File.xs:1229:13: note: in expansion of macro 'croak_and_free'
Socket.c: In function 'XS_Socket_pack_ip_mreq_source':
Socket.c:1694:7: warning: variable 'interface' set but not used [-Wunused-but-set-variable]
const-c.inc: In function 'constant_19':
const-c.inc:351:42: warning: unused parameter 'iv_return' [-Wunused-parameter]
re_exec.c: In function 'S_regtry':
re_exec.c:7063:30: warning: 'fold_array' may be used uninitialized in this function [-Wmaybe-uninitialized]
re_exec.c:6967:17: note: 'fold_array' was declared here
re_exec.c:7069:22: warning: 'folder' may be used uninitialized in this function [-Wmaybe-uninitialized]
re_exec.c:6966:16: note: 'folder' was declared here
regexec.c: In function 'S_regtry':
regexec.c:7063:30: warning: 'fold_array' may be used uninitialized in this function [-Wmaybe-uninitialized]
regexec.c:6967:17: note: 'fold_array' was declared here
regexec.c:7069:22: warning: 'folder' may be used uninitialized in this function [-Wmaybe-uninitialized]
regexec.c:6966:16: note: 'folder' was declared here
locale.c: In function 'S_my_langinfo_i':
locale.c:3852:28: warning: format '%d' expects argument of type 'int', but argument 3 has type 'nl_item {aka const long int}' [-Wformat=]
perl.h:4646:33: note: in definition of macro 'DEBUG__'
locale.c:3851:5: note: in expansion of macro 'DEBUG_Lv'
locale.c: In function 'S_my_setlocale_debug_string_i':
locale.c:6679:44: warning: unused parameter 'line' [-Wunused-parameter]
locale.c:659:1: warning: 'S_less_dicey_bool_setlocale_r' defined but not used [-Wunused-function]

Non-Fatal messages(gcc):



-- 
Report by Test::Smoke v1.71 running on perl 5.26.1
(Reporter v0.053 / Smoker v0.046)



nntp.perl.org: Perl Programming lists via nntp and http.
Comments to Ask Bjørn Hansen at ask@perl.org | Group listing | About