develooper Front page | perl.daily-build.reports | Postings from March 2021

Smoke [smoke-me/khw-locale] v5.33.8-216-gab306b0806 FAIL(F) netbsd8.2 (amd64/1 cpu)

Thread Next
From:
Carlos Guevara
Date:
March 29, 2021 14:04
Subject:
Smoke [smoke-me/khw-locale] v5.33.8-216-gab306b0806 FAIL(F) netbsd8.2 (amd64/1 cpu)
Message ID:
20210329140350.91AD926BFF1@cjg-netbsd8
Automated smoke report for branch smoke-me/khw-locale 5.33.9 patch ab306b0806b3997101d29e05162ee96e0c3476bb v5.33.8-216-gab306b0806
cjg-netbsd8: Intel 686-class (amd64/1 cpu)
    on        netbsd - 8.2
    using     g++ version 5.5.0
    smoketime 5 hours 14 minutes (average 39 minutes 18 seconds)

Summary: FAIL(F)

O = OK  F = Failure(s), extended report at the bottom
X = Failure(s) under TEST but not under harness
? = still running or test results not (yet) available
Build failures during:       - = unknown or N/A
c = Configure, m = make, M = make (after miniperl), t = make test-prep

v5.33.8-216-gab306b0806  Configuration (common) -Dcc=g++
----------- ---------------------------------------------------------
F F         
F F         -Duse64bitall
F F         -Duseithreads
F F         -Duseithreads -Duse64bitall
| +--------- -DDEBUGGING
+----------- no debugging


Testsuite was run only with 'harness'

Tests skipped on user request:
    # One test name on a line
Failures: (common-args) -Dcc=g++
[default] 
[default] -DDEBUGGING
[default] -Duse64bitall
[default] -DDEBUGGING -Duse64bitall
../t/porting/globvar.t......................................FAILED
    1
../t/porting/regen.t........................................FAILED
    36
    Non-zero exit status: 255
    Bad plan.  You planned 42 tests but ran 36.

[default] -Duseithreads
[default] -DDEBUGGING -Duseithreads
[default] -Duseithreads -Duse64bitall
[default] -DDEBUGGING -Duseithreads -Duse64bitall
../t/run/switches.t.........................................FAILED
    121, 123, 129
../t/re/fold_grind_8.t......................................FAILED
    No plan found in TAP output
../t/re/fold_grind_l.t......................................FAILED
    No plan found in TAP output
../t/re/pat_advanced_thr.t..................................FAILED
    No plan found in TAP output
../t/re/pat_psycho_thr.t....................................FAILED
    No plan found in TAP output
../t/re/pat_re_eval_thr.t...................................FAILED
    Bad plan.  You planned 506 tests but ran 0.
../t/re/pat_rt_report_thr.t.................................FAILED
    Bad plan.  You planned 2510 tests but ran 0.
../t/re/pat_special_cc_thr.t................................FAILED
    Bad plan.  You planned 9 tests but ran 0.
../t/re/pat_thr.t...........................................FAILED
    Bad plan.  You planned 1022 tests but ran 0.
../t/re/reg_email_thr.t.....................................FAILED
    No plan found in TAP output
../t/re/regexp_qr_embed_thr.t...............................FAILED
    No plan found in TAP output
../t/re/regexp_unicode_prop_thr.t...........................FAILED
    Bad plan.  You planned 1110 tests but ran 2.
../t/re/speed_thr.t.........................................FAILED
    Bad plan.  You planned 59 tests but ran 0.
../t/re/user_prop_race_thr.t................................FAILED
    1-3
../t/op/getpid.t............................................FAILED
    Bad plan.  You planned 3 tests but ran 1.
../t/op/index_thr.t.........................................FAILED
    Bad plan.  You planned 414 tests but ran 0.
../t/op/reset.t.............................................FAILED
    37-40
../t/op/substr_thr.t........................................FAILED
    Bad plan.  You planned 400 tests but ran 13.
../t/op/threads-dirh.t......................................FAILED
    1
    Bad plan.  You planned 6 tests but ran 1.
../t/op/threads.t...........................................FAILED
    1-3
    Bad plan.  You planned 30 tests but ran 3.
../t/porting/regen.t........................................FAILED
    36
    Non-zero exit status: 255
    Bad plan.  You planned 42 tests but ran 36.
../cpan/DB_File/t/db-threads.t..............................FAILED
    Bad plan.  You planned 7 tests but ran 2.
../cpan/Digest-MD5/t/threads.t..............................FAILED
    Bad plan.  You planned 2 tests but ran 0.
../cpan/Test-Simple/t/Legacy/threads.t......................FAILED
    Bad plan.  You planned 6 tests but ran 0.
../cpan/Test-Simple/t/Legacy/Regression/683_thread_todo.t...FAILED
    No plan found in TAP output
../cpan/Test-Simple/t/regression/fork_first.t...............FAILED
    No plan found in TAP output
../cpan/Test-Simple/t/Test2/acceptance/try_it_threads.t.....FAILED
    Bad plan.  You planned 6 tests but ran 0.
../cpan/Test-Simple/t/Test2/behavior/ipc_wait_timeout.t.....FAILED
    Bad plan.  You planned 6 tests but ran 4.
../cpan/Test-Simple/t/Test2/modules/API/Instance.t..........FAILED
    No plan found in TAP output
../cpan/Test-Simple/t/Test2/modules/Hub.t...................FAILED
    No plan found in TAP output
../cpan/Test-Simple/t/Test2/regression/693_ipc_ordering.t...FAILED
    No plan found in TAP output
../cpan/Tie-RefHash/t/threaded.t............................FAILED
    Bad plan.  You planned 14 tests but ran 3.
../cpan/version/t/07locale.t................................FAILED
    3
    Non-zero exit status: 1
../dist/Storable/t/threads.t................................FAILED
    Bad plan.  You planned 2 tests but ran 0.
../dist/Thread-Queue/t/01_basic.t...........................FAILED
    Bad plan.  You planned 81 tests but ran 2.
../dist/Thread-Queue/t/02_refs.t............................FAILED
    Bad plan.  You planned 46 tests but ran 6.
../dist/Thread-Queue/t/03_peek.t............................FAILED
    Bad plan.  You planned 19 tests but ran 1.
../dist/Thread-Queue/t/05_extract.t.........................FAILED
    Bad plan.  You planned 20 tests but ran 1.
../dist/Thread-Queue/t/06_insert.t..........................FAILED
    Bad plan.  You planned 16 tests but ran 1.
../dist/Thread-Queue/t/07_lock.t............................FAILED
    Bad plan.  You planned 3 tests but ran 1.
../dist/Thread-Queue/t/09_ended.t...........................FAILED
    Bad plan.  You planned 60 tests but ran 0.
../dist/Thread-Queue/t/10_timed.t...........................FAILED
    Bad plan.  You planned 19 tests but ran 2.
../dist/Thread-Queue/t/11_limit.t...........................FAILED
    Bad plan.  You planned 13 tests but ran 0.
../dist/Thread-Semaphore/t/01_basic.t.......................FAILED
    Bad plan.  You planned 10 tests but ran 2.
../dist/Thread-Semaphore/t/04_nonblocking.t.................FAILED
    Bad plan.  You planned 12 tests but ran 2.
../dist/Thread-Semaphore/t/05_force.t.......................FAILED
    Bad plan.  You planned 8 tests but ran 2.
../dist/Thread-Semaphore/t/06_timed.t.......................FAILED
    Bad plan.  You planned 10 tests but ran 2.
../dist/threads-shared/t/av_refs.t..........................FAILED
    Bad plan.  You planned 14 tests but ran 3.
../dist/threads-shared/t/av_simple.t........................FAILED
    Bad plan.  You planned 47 tests but ran 9.
../dist/threads-shared/t/blessed.t..........................FAILED
    Bad plan.  You planned 37 tests but ran 1.
../dist/threads-shared/t/clone.t............................FAILED
    Bad plan.  You planned 40 tests but ran 4.
../dist/threads-shared/t/cond.t.............................FAILED
    Bad plan.  You planned 32 tests but ran 2.
../dist/threads-shared/t/dualvar.t..........................FAILED
    Bad plan.  You planned 226 tests but ran 217.
../dist/threads-shared/t/hv_refs.t..........................FAILED
    Bad plan.  You planned 20 tests but ran 3.
../dist/threads-shared/t/hv_simple.t........................FAILED
    Bad plan.  You planned 16 tests but ran 2.
../dist/threads-shared/t/no_share.t.........................FAILED
    Bad plan.  You planned 6 tests but ran 3.
../dist/threads-shared/t/object.t...........................FAILED
    Bad plan.  You planned 28 tests but ran 5.
../dist/threads-shared/t/object2.t..........................FAILED
    Bad plan.  You planned 133 tests but ran 121.
../dist/threads-shared/t/shared_attr.t......................FAILED
    Bad plan.  You planned 101 tests but ran 2.
../dist/threads-shared/t/stress.t...........................FAILED
    Bad plan.  You planned 1 tests but ran 0.
../dist/threads-shared/t/sv_refs.t..........................FAILED
    Bad plan.  You planned 21 tests but ran 6.
../dist/threads-shared/t/sv_simple.t........................FAILED
    Bad plan.  You planned 11 tests but ran 3.
../dist/threads-shared/t/wait.t.............................FAILED
    Bad plan.  You planned 91 tests but ran 0.
../dist/threads-shared/t/waithires.t........................FAILED
    Bad plan.  You planned 63 tests but ran 0.
../dist/threads/t/basic.t...................................FAILED
    Bad plan.  You planned 34 tests but ran 2.
../dist/threads/t/blocks.t..................................FAILED
    Bad plan.  You planned 5 tests but ran 0.
../dist/threads/t/context.t.................................FAILED
    Bad plan.  You planned 31 tests but ran 1.
../dist/threads/t/end.t.....................................FAILED
    Bad plan.  You planned 6 tests but ran 1.
../dist/threads/t/err.t.....................................FAILED
    Bad plan.  You planned 10 tests but ran 1.
../dist/threads/t/exit.t....................................FAILED
    Bad plan.  You planned 18 tests but ran 1.
../dist/threads/t/free.t....................................FAILED
    Bad plan.  You planned 29 tests but ran 0.
../dist/threads/t/free2.t...................................FAILED
    Bad plan.  You planned 78 tests but ran 0.
../dist/threads/t/join.t....................................FAILED
    Bad plan.  You planned 20 tests but ran 1.
../dist/threads/t/kill.t....................................FAILED
    No plan found in TAP output
../dist/threads/t/kill2.t...................................FAILED
    No plan found in TAP output
../dist/threads/t/kill3.t...................................FAILED
    No plan found in TAP output
../dist/threads/t/libc.t....................................FAILED
    Bad plan.  You planned 11 tests but ran 1.
../dist/threads/t/list.t....................................FAILED
    Bad plan.  You planned 15 tests but ran 2.
../dist/threads/t/problems.t................................FAILED
    Bad plan.  You planned 10 tests but ran 1.
../dist/threads/t/stack.t...................................FAILED
    Bad plan.  You planned 18 tests but ran 4.
../dist/threads/t/state.t...................................FAILED
    Bad plan.  You planned 59 tests but ran 1.
../dist/threads/t/stress_cv.t...............................FAILED
    Bad plan.  You planned 61 tests but ran 1.
../dist/threads/t/stress_re.t...............................FAILED
    Bad plan.  You planned 61 tests but ran 1.
../dist/threads/t/stress_string.t...........................FAILED
    Bad plan.  You planned 61 tests but ran 1.
../dist/threads/t/thread.t..................................FAILED
    Bad plan.  You planned 35 tests but ran 1.
../ext/File-Glob/t/threads.t................................FAILED
    No plan found in TAP output
../ext/Hash-Util-FieldHash/t/03_class.t.....................FAILED
    Bad plan.  You planned 7 tests but ran 2.
../ext/Hash-Util-FieldHash/t/04_thread.t....................FAILED
    Bad plan.  You planned 30 tests but ran 6.
../ext/I18N-Langinfo/t/Langinfo.t...........................FAILED
    93
    Non-zero exit status: 1
../ext/PerlIO-encoding/t/threads.t..........................FAILED
    Bad plan.  You planned 4 tests but ran 0.
../ext/PerlIO-scalar/t/scalar.t.............................FAILED
    Bad plan.  You planned 125 tests but ran 84.
../ext/PerlIO-via/t/thread.t................................FAILED
    Bad plan.  You planned 2 tests but ran 0.
../ext/re/t/re_funcs_u.t....................................FAILED
    No plan found in TAP output
../ext/XS-APItest/t/clone-with-stack.t......................FAILED
    1-2, 4-8
../ext/XS-APItest/t/keyword_plugin_threads.t................FAILED
    1
../ext/XS-APItest/t/my_cxt.t................................FAILED
    Bad plan.  You planned 16 tests but ran 7.
../lib/locale_threads.t.....................................FAILED
    2
../lib/perl5db.t............................................FAILED
    135-138
../lib/Thread.t.............................................FAILED
    Bad plan.  You planned 13 tests but ran 0.

MANIFEST did not declare '.mailmap'

Compiler messages(gcc):
handy.h: In function 'const char* S_stdize_locale(int, const char*, const char**, size_t*)':
handy.h:719:31: warning: 'previous_start' may be used uninitialized in this function [-Wmaybe-uninitialized]
locale.c:1581:12: note: 'previous_start' was declared here
/usr/include/sys/cdefs_elf.h:67:20: error: missing binary operator before token "("
/usr/include/sys/cdefs_elf.h:73:20: error: missing binary operator before token "("
/usr/include/sys/cdefs_elf.h:79:20: error: missing binary operator before token "("
DB_File.xs: In function 'DB_File_type* ParseOpenInfo(int, char*, int, int, SV*)':
DB_File.xs:476:44: warning: suggest braces around empty body in an 'if' statement [-Wempty-body]
DB_File.xs:1044:13: note: in expansion of macro 'croak_and_free'
DB_File.xs:1050:13: note: in expansion of macro 'croak_and_free'
DB_File.xs:1056:17: note: in expansion of macro 'croak_and_free'
DB_File.xs:1091:17: note: in expansion of macro 'croak_and_free'
DB_File.xs:1140:17: note: in expansion of macro 'croak_and_free'
DB_File.xs:1229:13: note: in expansion of macro 'croak_and_free'
Socket.xs: In function 'void XS_Socket_inet_aton(CV*)':
Socket.xs:769:28: warning: missing initializer for member 'addrinfo::ai_family' [-Wmissing-field-initializers]
Socket.xs:769:28: warning: missing initializer for member 'addrinfo::ai_socktype' [-Wmissing-field-initializers]
Socket.xs:769:28: warning: missing initializer for member 'addrinfo::ai_protocol' [-Wmissing-field-initializers]
Socket.xs:769:28: warning: missing initializer for member 'addrinfo::ai_addrlen' [-Wmissing-field-initializers]
Socket.xs:769:28: warning: missing initializer for member 'addrinfo::ai_canonname' [-Wmissing-field-initializers]
Socket.xs:769:28: warning: missing initializer for member 'addrinfo::ai_addr' [-Wmissing-field-initializers]
Socket.xs:769:28: warning: missing initializer for member 'addrinfo::ai_next' [-Wmissing-field-initializers]
Socket.c: In function 'void XS_Socket_pack_ip_mreq_source(CV*)':
Socket.c:1694:7: warning: variable 'interface' set but not used [-Wunused-but-set-variable]
const-c.inc:351:42: warning: unused parameter 'iv_return' [-Wunused-parameter]
re_exec.c: In function 'bool S_regtry(regmatch_info*, char**)':
re_exec.c:7063:39: warning: 'fold_array' may be used uninitialized in this function [-Wmaybe-uninitialized]
re_exec.c:6967:17: note: 'fold_array' was declared here
re_exec.c:7069:28: warning: 'folder' may be used uninitialized in this function [-Wmaybe-uninitialized]
re_exec.c:6966:16: note: 'folder' was declared here
regexec.c: In function 'bool S_regtry(regmatch_info*, char**)':
regexec.c:7063:39: warning: 'fold_array' may be used uninitialized in this function [-Wmaybe-uninitialized]
regexec.c:6967:17: note: 'fold_array' was declared here
regexec.c:7069:28: warning: 'folder' may be used uninitialized in this function [-Wmaybe-uninitialized]
regexec.c:6966:16: note: 'folder' was declared here
locale.c: In function 'const char* S_my_langinfo_i(nl_item, unsigned int, const char*, const char**, size_t*, int*)':
locale.c:3960:72: warning: format '%d' expects argument of type 'int', but argument 3 has type 'nl_item {aka long int}' [-Wformat=]
perl.h:4645:33: note: in definition of macro 'DEBUG__'
locale.c:3959:5: note: in expansion of macro 'DEBUG_Lv'
ListUtil.xs: In function 'void XS_List__Util_reduce(CV*)':
ListUtil.xs:576:47: warning: 'retvals' may be used uninitialized in this function [-Wmaybe-uninitialized]
ListUtil.xs:530:9: note: 'retvals' was declared here
locale.c: In function 'int Perl_init_i18nl10n(PerlInterpreter*, int)':
locale.c:5207:82: warning: ignoring return value of 'const char* S_save_to_buffer(const char*, const char**, size_t*)', declared with attribute warn_unused_result [-Wunused-result]
handy.h: In function 'const char* S_stdize_locale(PerlInterpreter*, int, const char*, const char**, size_t*)':
locale.c:641:1: warning: 'bool S_less_dicey_bool_setlocale_r(PerlInterpreter*, int, const char*)' defined but not used [-Wunused-function]
DB_File.xs: In function 'DB_File_type* ParseOpenInfo(PerlInterpreter*, int, char*, int, int, SV*)':
Socket.xs: In function 'void XS_Socket_inet_aton(PerlInterpreter*, CV*)':
Socket.c: In function 'void XS_Socket_pack_ip_mreq_source(PerlInterpreter*, CV*)':
re_exec.c: In function 'bool S_regtry(PerlInterpreter*, regmatch_info*, char**)':
regexec.c: In function 'bool S_regtry(PerlInterpreter*, regmatch_info*, char**)':
locale.c: In function 'const char* S_my_langinfo_i(PerlInterpreter*, nl_item, unsigned int, const char*, const char**, size_t*, int*)':
ListUtil.xs: In function 'void XS_List__Util_reduce(PerlInterpreter*, CV*)':

Non-Fatal messages(gcc):



-- 
Report by Test::Smoke v1.71 running on perl 5.26.1
(Reporter v0.053 / Smoker v0.046)

Thread Next


nntp.perl.org: Perl Programming lists via nntp and http.
Comments to Ask Bjørn Hansen at ask@perl.org | Group listing | About