develooper Front page | perl.daily-build.reports | Postings from March 2021

Smoke [blead] v5.33.6-186-g8a526a6ca6 FAIL(Fc) linux 5.10.0-4-arm64[Debian GNU/Linux bullseye/sid] (aarch64/4 cpu)

From:
gregor herrmann
Date:
March 21, 2021 08:47
Subject:
Smoke [blead] v5.33.6-186-g8a526a6ca6 FAIL(Fc) linux 5.10.0-4-arm64[Debian GNU/Linux bullseye/sid] (aarch64/4 cpu)
Message ID:
E1lNtji-000265-6G@7of9.comodo.priv.at
Automated smoke report for branch blead 5.33.8 patch 8a526a6ca63b03a8d4ae6de591d114f61b91726b v5.33.6-186-g8a526a6ca6
7of9:  (aarch64/4 cpu)
    on        linux - 5.10.0-4-arm64 [Debian GNU/Linux bullseye/sid]
    using     cc version 10.2.1 20210110
    smoketime 14 hours 35 minutes (average 1 hour 49 minutes)

Summary: FAIL(Fc)

O = OK  F = Failure(s), extended report at the bottom
X = Failure(s) under TEST but not under harness
? = still running or test results not (yet) available
Build failures during:       - = unknown or N/A
c = Configure, m = make, M = make (after miniperl), t = make test-prep

v5.33.6-186-g8a526a6ca6  Configuration (common) none
----------- ---------------------------------------------------------
O O O O O O 
O O O O O O -Duse64bitint
F F F c - - -Duseithreads
c - - c - - -Duseithreads -Duse64bitint
| | | | | +- LC_ALL = C.UTF-8 -DDEBUGGING
| | | | +--- PERLIO = perlio -DDEBUGGING
| | | +----- PERLIO = stdio  -DDEBUGGING
| | +------- LC_ALL = C.UTF-8
| +--------- PERLIO = perlio
+----------- PERLIO = stdio 

Testsuite was run only with 'harness' and HARNESS_OPTIONS=j5

Tests skipped on user request:
    # One test name on a line
Failures: (common-args) none
[stdio] -Duseithreads
../t/porting/extrefs.t......................................FAILED
    1
../cpan/ExtUtils-Constant/t/Constant.t......................FAILED
    3
    Bad plan.  You planned 302 tests but ran 3.
../cpan/ExtUtils-MakeMaker/t/02-xsdynamic.t.................FAILED
    4, 10, 16, 22, 28, 34, 40, 46, 52, 58, 64
    70
    Non-zero exit status: 12
../cpan/ExtUtils-MakeMaker/t/03-xsstatic.t..................FAILED
    4, 10, 16, 22, 28, 34
    Non-zero exit status: 6
../lib/ExtUtils/t/Embed.t...................................FAILED
    1, 10

[perlio/C.UTF-8] -Duseithreads
../t/porting/extrefs.t......................................FAILED
    1
../cpan/ExtUtils-MakeMaker/t/02-xsdynamic.t.................FAILED
    4, 10, 16, 22, 28, 34, 40, 46, 52, 58, 64
    70
    Non-zero exit status: 12
../cpan/ExtUtils-MakeMaker/t/03-xsstatic.t..................FAILED
    4, 10, 16, 22, 28, 34
    Non-zero exit status: 6
../cpan/ExtUtils-Constant/t/Constant.t......................FAILED
    3
    Bad plan.  You planned 302 tests but ran 3.
../lib/ExtUtils/t/Embed.t...................................FAILED
    1, 10

MANIFEST did not declare '.mailmap'

Compiler messages(gcc):
makefile:258: warning: ignoring prerequisites on suffix rule definition
makefile:254: warning: ignoring prerequisites on suffix rule definition

Non-Fatal messages(gcc):



-- 
Report by Test::Smoke v1.78 running on perl 5.32.1
(Reporter v0.054 / Smoker v0.046)



nntp.perl.org: Perl Programming lists via nntp and http.
Comments to Ask Bjørn Hansen at ask@perl.org | Group listing | About