develooper Front page | perl.daily-build.reports | Postings from March 2021

Smoke [smoke-me/khw-locale] v5.33.6-335-g1b091d66b6 FAIL(F) freebsd13.0-CURRENT (amd64/1 cpu)

Thread Next
From:
Carlos Guevara
Date:
March 16, 2021 04:12
Subject:
Smoke [smoke-me/khw-locale] v5.33.6-335-g1b091d66b6 FAIL(F) freebsd13.0-CURRENT (amd64/1 cpu)
Message ID:
202103160412.12G4C8JZ043950@cjg-freebsd13
Automated smoke report for branch smoke-me/khw-locale 5.33.8 patch 1b091d66b693f2744a68afcf0d7f850ba4c6fdb0 v5.33.6-335-g1b091d66b6
cjg-freebsd13: Intel(R) Xeon(R) CPU E5-2620 v2 @ 2.10GHz (amd64/1 cpu)
    on        freebsd - 13.0-CURRENT
    using     clang version FreeBSD Clang 11.0.0 (git@github.com:llvm/llvm-project.git llvmorg-11.0.0-0-g176249bd673)
    smoketime 9 hours 5 minutes (average 45 minutes 28 seconds)

Summary: FAIL(F)

O = OK  F = Failure(s), extended report at the bottom
X = Failure(s) under TEST but not under harness
? = still running or test results not (yet) available
Build failures during:       - = unknown or N/A
c = Configure, m = make, M = make (after miniperl), t = make test-prep

v5.33.6-335-g1b091d66b6  Configuration (common) -Dcc=clang
----------- ---------------------------------------------------------
F F         
F F         -Duse64bitall
F F         -Duselongdouble
F F         -Duseithreads
F F         -Duseithreads -Duse64bitall
F F         -Duseithreads -Duselongdouble
| +--------- -DDEBUGGING
+----------- no debugging


Testsuite was run only with 'harness'

Tests skipped on user request:
    # One test name on a line
Failures: (common-args) -Dcc=clang
[default] 
[default] -DDEBUGGING
[default] -Duse64bitall
[default] -DDEBUGGING -Duse64bitall
[default] -Duselongdouble
[default] -DDEBUGGING -Duselongdouble
../dist/I18N-Collate/t/I18N-Collate.t.......................FAILED
    6-7
    Non-zero exit status: 2

[default] -Duseithreads
[default] -DDEBUGGING -Duseithreads
[default] -Duseithreads -Duse64bitall
[default] -DDEBUGGING -Duseithreads -Duse64bitall
[default] -Duseithreads -Duselongdouble
[default] -DDEBUGGING -Duseithreads -Duselongdouble
../cpan/Test-Simple/t/Test2/regression/693_ipc_ordering.t...??????
../dist/I18N-Collate/t/I18N-Collate.t.......................FAILED
    6-7
    Non-zero exit status: 2
../dist/threads-shared/t/av_simple.t........................??????
../dist/threads/t/kill.t....................................FAILED
    Non-zero exit status: 29
    Bad plan.  You planned 18 tests but ran 2.
../lib/locale_threads.t.....................................FAILED
    Non-zero exit status: 22
    Bad plan.  You planned 2 tests but ran 1.

MANIFEST did not declare '.mailmap'

Passed Todo tests: (common-args) -Dcc=clang
[default] 
[default] -DDEBUGGING
[default] -Duse64bitall
[default] -DDEBUGGING -Duse64bitall
[default] -Duselongdouble
[default] -DDEBUGGING -Duselongdouble
[default] -Duseithreads
[default] -DDEBUGGING -Duseithreads
[default] -Duseithreads -Duse64bitall
[default] -DDEBUGGING -Duseithreads -Duse64bitall
[default] -Duseithreads -Duselongdouble
[default] -DDEBUGGING -Duseithreads -Duselongdouble
../dist/Net-Ping/t/010_pingecho.t...........................PASSED
    2
../dist/Net-Ping/t/450_service.t............................PASSED
    9, 18

Compiler messages(gcc):
sv.c:12517:41: warning: adding 'int' to a string does not append to the string [-Wstring-plus-int]
./handy.h:717:37: note: expanded from macro 'strnEQ'
sv.c:12517:41: note: use array indexing to silence this warning
locale.c:195:19: warning: unused variable 'C_codeset' [-Wunused-const-variable]
POSIX.xs:3230:38: warning: variable 'wc' is uninitialized when used here [-Wuninitialized]
../../embed.h:668:51: note: expanded from macro 'sv_setiv_mg'
POSIX.xs:3218:23: note: initialize the variable 'wc' to silence this warning
re_comp.c:8219:37: warning: result of comparison against a string literal is unspecified (use an explicit string comparison function instead) [-Wstring-compare]
../../scope.h:212:25: note: expanded from macro 'LEAVE_with_name'
/usr/include/assert.h:56:21: note: expanded from macro 'assert'
re_comp.c:6647:13: note: expanded from macro 'CHECK_RESTUDY_GOTO_butfirst'
re_comp.c:8267:2: warning: result of comparison against a string literal is unspecified (use an explicit string comparison function instead) [-Wstring-compare]
toke.c:4327:5: warning: result of comparison against a string literal is unspecified (use an explicit string comparison function instead) [-Wstring-compare]
./scope.h:212:25: note: expanded from macro 'LEAVE_with_name'
toke.c:6277:20: warning: result of comparison against a string literal is unspecified (use an explicit string comparison function instead) [-Wstring-compare]
toke.c:12106:3: warning: result of comparison against a string literal is unspecified (use an explicit string comparison function instead) [-Wstring-compare]
regcomp.c:8219:37: warning: result of comparison against a string literal is unspecified (use an explicit string comparison function instead) [-Wstring-compare]
regcomp.c:6647:13: note: expanded from macro 'CHECK_RESTUDY_GOTO_butfirst'
regcomp.c:8267:2: warning: result of comparison against a string literal is unspecified (use an explicit string comparison function instead) [-Wstring-compare]
pp_hot.c:192:17: warning: result of comparison against a string literal is unspecified (use an explicit string comparison function instead) [-Wstring-compare]
pp_hot.c:4562:5: warning: result of comparison against a string literal is unspecified (use an explicit string comparison function instead) [-Wstring-compare]
pp_hot.c:4569:9: warning: result of comparison against a string literal is unspecified (use an explicit string comparison function instead) [-Wstring-compare]
pp.c:5774:2: warning: result of comparison against a string literal is unspecified (use an explicit string comparison function instead) [-Wstring-compare]
pp.c:5830:2: warning: result of comparison against a string literal is unspecified (use an explicit string comparison function instead) [-Wstring-compare]
pp.c:6418:13: warning: result of comparison against a string literal is unspecified (use an explicit string comparison function instead) [-Wstring-compare]
pp_ctl.c:1107:5: warning: result of comparison against a string literal is unspecified (use an explicit string comparison function instead) [-Wstring-compare]
pp_ctl.c:1113:9: warning: result of comparison against a string literal is unspecified (use an explicit string comparison function instead) [-Wstring-compare]
pp_ctl.c:3595:5: warning: result of comparison against a string literal is unspecified (use an explicit string comparison function instead) [-Wstring-compare]
pp_ctl.c:4116:21: warning: result of comparison against a string literal is unspecified (use an explicit string comparison function instead) [-Wstring-compare]
pp_ctl.c:4829:5: warning: result of comparison against a string literal is unspecified (use an explicit string comparison function instead) [-Wstring-compare]
pp_ctl.c:4928:17: warning: result of comparison against a string literal is unspecified (use an explicit string comparison function instead) [-Wstring-compare]
pp_ctl.c:4960:17: warning: result of comparison against a string literal is unspecified (use an explicit string comparison function instead) [-Wstring-compare]
pp_ctl.c:4982:13: warning: result of comparison against a string literal is unspecified (use an explicit string comparison function instead) [-Wstring-compare]
pp_ctl.c:5828:9: warning: result of comparison against a string literal is unspecified (use an explicit string comparison function instead) [-Wstring-compare]
pp_sys.c:312:13: warning: result of comparison against a string literal is unspecified (use an explicit string comparison function instead) [-Wstring-compare]
pp_sys.c:397:5: warning: result of comparison against a string literal is unspecified (use an explicit string comparison function instead) [-Wstring-compare]
pp_sys.c:586:5: warning: result of comparison against a string literal is unspecified (use an explicit string comparison function instead) [-Wstring-compare]
pp_sys.c:989:5: warning: result of comparison against a string literal is unspecified (use an explicit string comparison function instead) [-Wstring-compare]
pp_sys.c:1024:16: warning: result of comparison against a string literal is unspecified (use an explicit string comparison function instead) [-Wstring-compare]
locale.c:1392:36: warning: unused parameter 'line' [-Wunused-parameter]
locale.c:1630:1: warning: unused function 'S_setlocale_failure_panic_i' [-Wunused-function]

Non-Fatal messages(gcc):



-- 
Report by Test::Smoke v1.71 running on perl 5.30.2
(Reporter v0.053 / Smoker v0.046)

Thread Next


nntp.perl.org: Perl Programming lists via nntp and http.
Comments to Ask Bjørn Hansen at ask@perl.org | Group listing | About