develooper Front page | perl.daily-build.reports | Postings from March 2021

Smoke [smoke-me/khw-locale] v5.33.6-263-g43dfe97843 FAIL(F) netbsd8.2 (amd64/1 cpu)

From:
Carlos Guevara
Date:
March 5, 2021 19:53
Subject:
Smoke [smoke-me/khw-locale] v5.33.6-263-g43dfe97843 FAIL(F) netbsd8.2 (amd64/1 cpu)
Message ID:
20210305195338.B573726C04F@cjg-netbsd8
Automated smoke report for branch smoke-me/khw-locale 5.33.8 patch 43dfe97843ee0c7c751a896edb037406c391630d v5.33.6-263-g43dfe97843
cjg-netbsd8: Intel 686-class (amd64/1 cpu)
    on        netbsd - 8.2
    using     gcc version 5.5.0
    smoketime 5 hours 30 minutes (average 41 minutes 18 seconds)

Summary: FAIL(F)

O = OK  F = Failure(s), extended report at the bottom
X = Failure(s) under TEST but not under harness
? = still running or test results not (yet) available
Build failures during:       - = unknown or N/A
c = Configure, m = make, M = make (after miniperl), t = make test-prep

v5.33.6-263-g43dfe97843  Configuration (common) -Dcc=gcc
----------- ---------------------------------------------------------
O O         
O O         -Duse64bitall
F F         -Duseithreads
F F         -Duseithreads -Duse64bitall
| +--------- -DDEBUGGING
+----------- no debugging


Testsuite was run only with 'harness'

Tests skipped on user request:
    # One test name on a line
Failures: (common-args) -Dcc=gcc
[default] -Duseithreads
[default] -DDEBUGGING -Duseithreads
[default] -Duseithreads -Duse64bitall
[default] -DDEBUGGING -Duseithreads -Duse64bitall
../t/re/fold_grind_8.t......................................FAILED
    28-7158, 7160-9536

MANIFEST did not declare '.mailmap'

Compiler messages(gcc):
locale.c:410:1: warning: 'S_category_name' defined but not used [-Wunused-function]
locale.c: In function 'Perl_localeconv':
locale.c:3111:23: warning: 'strings' may be used uninitialized in this function [-Wmaybe-uninitialized]
locale.c:3091:36: note: 'strings' was declared here
embed.h:1732:47: warning: 'locale_is_utf8' may be used uninitialized in this function [-Wmaybe-uninitialized]
locale.c:3090:13: note: 'locale_is_utf8' was declared here
/usr/include/sys/cdefs_elf.h:67:20: error: missing binary operator before token "("
/usr/include/sys/cdefs_elf.h:73:20: error: missing binary operator before token "("
/usr/include/sys/cdefs_elf.h:79:20: error: missing binary operator before token "("
DB_File.xs: In function 'ParseOpenInfo':
DB_File.xs:476:44: warning: suggest braces around empty body in an 'if' statement [-Wempty-body]
DB_File.xs:1044:13: note: in expansion of macro 'croak_and_free'
DB_File.xs:1050:13: note: in expansion of macro 'croak_and_free'
DB_File.xs:1056:17: note: in expansion of macro 'croak_and_free'
DB_File.xs:1091:17: note: in expansion of macro 'croak_and_free'
DB_File.xs:1140:17: note: in expansion of macro 'croak_and_free'
DB_File.xs:1229:13: note: in expansion of macro 'croak_and_free'
Socket.c: In function 'XS_Socket_pack_ip_mreq_source':
Socket.c:1694:7: warning: variable 'interface' set but not used [-Wunused-but-set-variable]
const-c.inc: In function 'constant_19':
const-c.inc:351:42: warning: unused parameter 'iv_return' [-Wunused-parameter]
re_exec.c: In function 'S_regtry':
re_exec.c:7039:30: warning: 'fold_array' may be used uninitialized in this function [-Wmaybe-uninitialized]
re_exec.c:6943:17: note: 'fold_array' was declared here
re_exec.c:7045:22: warning: 'folder' may be used uninitialized in this function [-Wmaybe-uninitialized]
re_exec.c:6942:16: note: 'folder' was declared here
regexec.c: In function 'S_regtry':
regexec.c:7039:30: warning: 'fold_array' may be used uninitialized in this function [-Wmaybe-uninitialized]
regexec.c:6943:17: note: 'fold_array' was declared here
regexec.c:7045:22: warning: 'folder' may be used uninitialized in this function [-Wmaybe-uninitialized]
regexec.c:6942:16: note: 'folder' was declared here
locale.c: In function 'S_my_langinfo_i':
locale.c:3584:28: warning: format '%d' expects argument of type 'int', but argument 3 has type 'nl_item {aka const long int}' [-Wformat=]
perl.h:4613:46: note: in definition of macro 'DEBUG__'
locale.c:3583:5: note: in expansion of macro 'DEBUG_Lv'
dump.c: In function 'Perl_sv_peek':
perl.h:6675:27: warning: implicit declaration of function 'Perl_locale_panic' [-Wimplicit-function-declaration]
perl.h:6842:19: note: in expansion of macro 'locale_panic_'
perl.h:7121:13: note: in expansion of macro 'LC_NUMERIC_LOCK'
dump.c:517:9: note: in expansion of macro 'STORE_LC_NUMERIC_SET_STANDARD'
vutil.c: In function 'Perl_upg_version':
vutil.c:637:13: note: in expansion of macro 'LC_NUMERIC_LOCK'
sv.c: In function 'Perl_sv_2pv_flags':
perl.h:7067:13: note: in expansion of macro 'LC_NUMERIC_LOCK'
perl.h:7087:9: note: in expansion of macro 'STORE_LC_NUMERIC_SET_TO_NEEDED_IN'
sv.c:3190:21: note: in expansion of macro 'STORE_LC_NUMERIC_SET_TO_NEEDED'
pp_ctl.c: In function 'Perl_pp_formline':
pp_ctl.c:880:17: note: in expansion of macro 'STORE_LC_NUMERIC_SET_TO_NEEDED'
numeric.c: In function 'S_strtod':
numeric.c:37:5: note: in expansion of macro 'STORE_LC_NUMERIC_SET_TO_NEEDED'
POSIX.xs: In function 'XS_POSIX_strtod':
../../perl.h:6675:27: warning: implicit declaration of function 'Perl_locale_panic' [-Wimplicit-function-declaration]
../../perl.h:6842:19: note: in expansion of macro 'locale_panic_'
../../perl.h:7132:13: note: in expansion of macro 'LC_NUMERIC_LOCK'
POSIX.xs:3289:9: note: in expansion of macro 'STORE_LC_NUMERIC_FORCE_TO_UNDERLYING'
sv.c: In function 'Perl_sv_2nv_flags':
perl.h:4588:40: note: in definition of macro 'DEBUG_c'
sv.c:2661:13: note: in expansion of macro 'STORE_LC_NUMERIC_SET_STANDARD'

Non-Fatal messages(gcc):



-- 
Report by Test::Smoke v1.71 running on perl 5.26.1
(Reporter v0.053 / Smoker v0.046)



nntp.perl.org: Perl Programming lists via nntp and http.
Comments to Ask Bjørn Hansen at ask@perl.org | Group listing | About