develooper Front page | perl.daily-build.reports | Postings from March 2021

Smoke [smoke-me/khw-locale] v5.33.6-258-g8aff6ba1a1 FAIL(Fm) freebsd12.2-RELEASE-p4 (amd64/1 cpu)

From:
Carlos Guevara
Date:
March 4, 2021 00:53
Subject:
Smoke [smoke-me/khw-locale] v5.33.6-258-g8aff6ba1a1 FAIL(Fm) freebsd12.2-RELEASE-p4 (amd64/1 cpu)
Message ID:
202103040053.1240rSju079133@cjg-freebsd12
Automated smoke report for branch smoke-me/khw-locale 5.33.8 patch 8aff6ba1a14f881e74b9b59a2424ac1d34b4b880 v5.33.6-258-g8aff6ba1a1
cjg-freebsd12: Intel(R) Xeon(R) CPU E5-2620 v2 @ 2.10GHz (amd64/1 cpu)
    on        freebsd - 12.2-RELEASE-p4
    using     clang version FreeBSD Clang 10.0.1 (git@github.com:llvm/llvm-project.git llvmorg-10.0.1-0-gef32c611aa2)
    smoketime 5 hours 26 minutes (average 27 minutes 15 seconds)

Summary: FAIL(Fm)

O = OK  F = Failure(s), extended report at the bottom
X = Failure(s) under TEST but not under harness
? = still running or test results not (yet) available
Build failures during:       - = unknown or N/A
c = Configure, m = make, M = make (after miniperl), t = make test-prep

v5.33.6-258-g8aff6ba1a1  Configuration (common) -Dcc=clang
----------- ---------------------------------------------------------
F F         
F F         -Duse64bitall
F F         -Duselongdouble
m F         -Duseithreads
m F         -Duseithreads -Duse64bitall
m F         -Duseithreads -Duselongdouble
| +--------- -DDEBUGGING
+----------- no debugging


Testsuite was run only with 'harness'

Tests skipped on user request:
    # One test name on a line
Failures: (common-args) -Dcc=clang
[default] 
[default] -DDEBUGGING
[default] -Duse64bitall
[default] -DDEBUGGING -Duse64bitall
[default] -Duselongdouble
[default] -DDEBUGGING -Duselongdouble
../ext/POSIX/t/wrappers.t...................................FAILED
    Non-zero exit status: 22
    No plan found in TAP output
../lib/locale.t.............................................FAILED
    Non-zero exit status: 22
    No plan found in TAP output

[default] -DDEBUGGING -Duseithreads
[default] -DDEBUGGING -Duseithreads -Duse64bitall
[default] -DDEBUGGING -Duseithreads -Duselongdouble
../t/io/errnosig.t..........................................FAILED
    Bad plan.  You planned 1 tests but ran 0.
../t/op/magic.t.............................................FAILED
    Bad plan.  You planned 192 tests but ran 143.
../cpan/Test-Simple/t/Test2/behavior/err_var.t..............FAILED
    No plan found in TAP output
../cpan/Test-Simple/t/Test2/modules/API/Context.t...........FAILED
    No plan found in TAP output
../lib/locale.t.............................................FAILED
    447
../lib/locale_threads.t.....................................FAILED

MANIFEST did not declare '.mailmap'

Passed Todo tests: (common-args) -Dcc=clang
[default] 
[default] -DDEBUGGING
[default] -Duse64bitall
[default] -DDEBUGGING -Duse64bitall
[default] -Duselongdouble
[default] -DDEBUGGING -Duselongdouble
[default] -DDEBUGGING -Duseithreads
[default] -DDEBUGGING -Duseithreads -Duse64bitall
[default] -DDEBUGGING -Duseithreads -Duselongdouble
../dist/Net-Ping/t/010_pingecho.t...........................PASSED
    2
../dist/Net-Ping/t/450_service.t............................PASSED
    9, 18

Compiler messages(gcc):
sv.c:12517:41: warning: adding 'int' to a string does not append to the string [-Wstring-plus-int]
./handy.h:717:37: note: expanded from macro 'strnEQ'
sv.c:12517:41: note: use array indexing to silence this warning
locale.c:410:1: warning: unused function 'S_category_name' [-Wunused-function]
locale.c:89:19: warning: unused variable 'C_codeset' [-Wunused-const-variable]
POSIX.xs:3223:38: warning: variable 'wc' is uninitialized when used here [-Wuninitialized]
../../embed.h:672:51: note: expanded from macro 'sv_setiv_mg'
POSIX.xs:3211:23: note: initialize the variable 'wc' to silence this warning
re_comp.c:8219:37: warning: result of comparison against a string literal is unspecified (use an explicit string comparison function instead) [-Wstring-compare]
../../scope.h:212:25: note: expanded from macro 'LEAVE_with_name'
/usr/include/assert.h:56:21: note: expanded from macro 'assert'
re_comp.c:6647:13: note: expanded from macro 'CHECK_RESTUDY_GOTO_butfirst'
re_comp.c:8267:2: warning: result of comparison against a string literal is unspecified (use an explicit string comparison function instead) [-Wstring-compare]
toke.c:4327:5: warning: result of comparison against a string literal is unspecified (use an explicit string comparison function instead) [-Wstring-compare]
./scope.h:212:25: note: expanded from macro 'LEAVE_with_name'
toke.c:6277:20: warning: result of comparison against a string literal is unspecified (use an explicit string comparison function instead) [-Wstring-compare]
toke.c:12106:3: warning: result of comparison against a string literal is unspecified (use an explicit string comparison function instead) [-Wstring-compare]
regcomp.c:8219:37: warning: result of comparison against a string literal is unspecified (use an explicit string comparison function instead) [-Wstring-compare]
regcomp.c:6647:13: note: expanded from macro 'CHECK_RESTUDY_GOTO_butfirst'
regcomp.c:8267:2: warning: result of comparison against a string literal is unspecified (use an explicit string comparison function instead) [-Wstring-compare]
pp_hot.c:192:17: warning: result of comparison against a string literal is unspecified (use an explicit string comparison function instead) [-Wstring-compare]
pp_hot.c:4562:5: warning: result of comparison against a string literal is unspecified (use an explicit string comparison function instead) [-Wstring-compare]
pp_hot.c:4569:9: warning: result of comparison against a string literal is unspecified (use an explicit string comparison function instead) [-Wstring-compare]
pp.c:5768:2: warning: result of comparison against a string literal is unspecified (use an explicit string comparison function instead) [-Wstring-compare]
pp.c:5824:2: warning: result of comparison against a string literal is unspecified (use an explicit string comparison function instead) [-Wstring-compare]
pp.c:6412:13: warning: result of comparison against a string literal is unspecified (use an explicit string comparison function instead) [-Wstring-compare]
pp_ctl.c:1107:5: warning: result of comparison against a string literal is unspecified (use an explicit string comparison function instead) [-Wstring-compare]
pp_ctl.c:1113:9: warning: result of comparison against a string literal is unspecified (use an explicit string comparison function instead) [-Wstring-compare]
pp_ctl.c:3595:5: warning: result of comparison against a string literal is unspecified (use an explicit string comparison function instead) [-Wstring-compare]
pp_ctl.c:4116:21: warning: result of comparison against a string literal is unspecified (use an explicit string comparison function instead) [-Wstring-compare]
pp_ctl.c:4829:5: warning: result of comparison against a string literal is unspecified (use an explicit string comparison function instead) [-Wstring-compare]
pp_ctl.c:4928:17: warning: result of comparison against a string literal is unspecified (use an explicit string comparison function instead) [-Wstring-compare]
pp_ctl.c:4960:17: warning: result of comparison against a string literal is unspecified (use an explicit string comparison function instead) [-Wstring-compare]
pp_ctl.c:4982:13: warning: result of comparison against a string literal is unspecified (use an explicit string comparison function instead) [-Wstring-compare]
pp_ctl.c:5828:9: warning: result of comparison against a string literal is unspecified (use an explicit string comparison function instead) [-Wstring-compare]
pp_sys.c:312:13: warning: result of comparison against a string literal is unspecified (use an explicit string comparison function instead) [-Wstring-compare]
pp_sys.c:397:5: warning: result of comparison against a string literal is unspecified (use an explicit string comparison function instead) [-Wstring-compare]
pp_sys.c:586:5: warning: result of comparison against a string literal is unspecified (use an explicit string comparison function instead) [-Wstring-compare]
pp_sys.c:989:5: warning: result of comparison against a string literal is unspecified (use an explicit string comparison function instead) [-Wstring-compare]
pp_sys.c:1024:16: warning: result of comparison against a string literal is unspecified (use an explicit string comparison function instead) [-Wstring-compare]
locale.c:1103:33: warning: unused parameter 'recalc_LC_ALL' [-Wunused-parameter]
locale.c:1104:36: warning: unused parameter 'line' [-Wunused-parameter]
locale.c:5942:13: warning: ignoring return value of function declared with 'warn_unused_result' attribute [-Wunused-result]
./embed.h:1740:25: note: expanded from macro 'save_to_buffer'
locale.c:6175:5: error: use of undeclared identifier 'my_perl'
./embed.h:1735:37: note: expanded from macro 'new_LC_ALL'
./perl.h:160:18: note: expanded from macro 'aTHX_'
./perl.h:155:16: note: expanded from macro 'aTHX'
locale.c:1194:64: warning: format specifies type 'void *' but the argument has type 'line_t' (aka 'unsigned int') [-Wformat]
./perl.h:4633:46: note: expanded from macro 'DEBUG_Lv'
./perl.h:4613:46: note: expanded from macro 'DEBUG__'
locale.c:1194:70: warning: data argument not used by format string [-Wformat-extra-args]
locale.c:1335:1: warning: unused function 'S_setlocale_failure_panic_i' [-Wunused-function]

Non-Fatal messages(gcc):



-- 
Report by Test::Smoke v1.71 running on perl 5.30.2
(Reporter v0.053 / Smoker v0.046)



nntp.perl.org: Perl Programming lists via nntp and http.
Comments to Ask Bjørn Hansen at ask@perl.org | Group listing | About