develooper Front page | perl.daily-build.reports | Postings from March 2021

Smoke [smoke-me/khw-locale] v5.33.6-258-g8aff6ba1a1 FAIL(Fm)dragonfly 5.8-RELEASE (x86_64/1 cpu)

Thread Next
From:
Carlos Guevara
Date:
March 4, 2021 00:27
Subject:
Smoke [smoke-me/khw-locale] v5.33.6-258-g8aff6ba1a1 FAIL(Fm)dragonfly 5.8-RELEASE (x86_64/1 cpu)
Message ID:
6040295b.9bc.92defe4@cjg-dragonfly5
Automated smoke report for branch smoke-me/khw-locale 5.33.8 patch 8aff6ba1a14f881e74b9b59a2424ac1d34b4b880 v5.33.6-258-g8aff6ba1a1
cjg-dragonfly5: Intel(R) Xeon(R) CPU E5-2620 v2 @ 2.10GHz (x86_64/1 cpu)
    on        dragonfly - 5.8-RELEASE
    using     gcc version 8.3 [DragonFly] Release/2019-02-22
    smoketime 6 hours 9 minutes (average 30 minutes 46 seconds)

Summary: FAIL(Fm)

O = OK  F = Failure(s), extended report at the bottom
X = Failure(s) under TEST but not under harness
? = still running or test results not (yet) available
Build failures during:       - = unknown or N/A
c = Configure, m = make, M = make (after miniperl), t = make test-prep

v5.33.6-258-g8aff6ba1a1  Configuration (common) -Dcc=gcc
----------- ---------------------------------------------------------
F F         
F F         -Duse64bitall
F F         -Duselongdouble
m F         -Duseithreads
m F         -Duseithreads -Duse64bitall
m F         -Duseithreads -Duselongdouble
| +--------- -DDEBUGGING
+----------- no debugging


Testsuite was run only with 'harness'

Tests skipped on user request:
    # One test name on a line
Failures: (common-args) -Dcc=gcc
[default] 
[default] -DDEBUGGING
[default] -Duse64bitall
[default] -DDEBUGGING -Duse64bitall
[default] -Duselongdouble
[default] -DDEBUGGING -Duselongdouble
../ext/POSIX/t/wrappers.t...................................FAILED
    Non-zero exit status: 22
    No plan found in TAP output
../lib/locale.t.............................................FAILED
    Non-zero exit status: 22
    No plan found in TAP output

[default] -DDEBUGGING -Duseithreads
[default] -DDEBUGGING -Duseithreads -Duse64bitall
[default] -DDEBUGGING -Duseithreads -Duselongdouble
../t/io/errnosig.t..........................................FAILED
    Bad plan.  You planned 1 tests but ran 0.
../t/op/magic.t.............................................FAILED
    Bad plan.  You planned 192 tests but ran 143.
../cpan/Test-Simple/t/Test2/behavior/err_var.t..............FAILED
    No plan found in TAP output
../cpan/Test-Simple/t/Test2/modules/API/Context.t...........FAILED
    No plan found in TAP output
../lib/locale.t.............................................FAILED
    No plan found in TAP output
../lib/locale_threads.t.....................................FAILED
    No plan found in TAP output

MANIFEST did not declare '.mailmap'

Passed Todo tests: (common-args) -Dcc=gcc
[default] 
[default] -DDEBUGGING
[default] -Duse64bitall
[default] -DDEBUGGING -Duse64bitall
[default] -Duselongdouble
[default] -DDEBUGGING -Duselongdouble
[default] -DDEBUGGING -Duseithreads
[default] -DDEBUGGING -Duseithreads -Duse64bitall
[default] -DDEBUGGING -Duseithreads -Duselongdouble
../t/op/stat.t..............................................PASSED
    9

Compiler messages(gcc):
locale.c:410:1: warning: 'S_category_name' defined but not used [-Wunused-function]
locale.c:89:19: warning: 'C_codeset' defined but not used [-Wunused-const-variable=]
DB_File.xs: In function 'ParseOpenInfo':
DB_File.xs:476:44: warning: suggest braces around empty body in an 'if' statement [-Wempty-body]
DB_File.xs:1044:13: note: in expansion of macro 'croak_and_free'
DB_File.xs:1050:13: note: in expansion of macro 'croak_and_free'
DB_File.xs:1056:17: note: in expansion of macro 'croak_and_free'
DB_File.xs:1091:17: note: in expansion of macro 'croak_and_free'
DB_File.xs:1140:17: note: in expansion of macro 'croak_and_free'
DB_File.xs:1229:13: note: in expansion of macro 'croak_and_free'
Socket.c: In function 'XS_Socket_pack_ip_mreq_source':
Socket.c:1694:7: warning: variable 'interface' set but not used [-Wunused-but-set-variable]
locale.c: In function 'S_calculate_LC_ALL':
locale.c:730:16: warning: variable 'new_len' set but not used [-Wunused-but-set-variable]
locale.c: In function 'S_emulate_setlocale_i':
locale.c:1103:33: warning: unused parameter 'recalc_LC_ALL' [-Wunused-parameter]
locale.c:1104:36: warning: unused parameter 'line' [-Wunused-parameter]
locale.c: In function 'Perl_thread_locale_init':
perl.h:155:16: error: 'my_perl' undeclared (first use in this function); did you mean 'my_fork'?
perl.h:160:18: note: in expansion of macro 'aTHX'
embed.h:1735:37: note: in expansion of macro 'aTHX_'
locale.c:6175:5: note: in expansion of macro 'new_LC_ALL'
perl.h:155:16: note: each undeclared identifier is reported only once for each function it appears in
locale.c: In function 'Perl_switch_to_global_locale':
embed.h:1740:25: warning: ignoring return value of 'S_save_to_buffer', declared with attribute warn_unused_result [-Wunused-result]
embed.h:1740:25: note: in definition of macro 'save_to_buffer'
locale.c:1335:1: warning: 'S_setlocale_failure_panic_i' defined but not used [-Wunused-function]
locale.c:1194:26: warning: format '%p' expects argument of type 'void *', but argument 3 has type 'line_t' {aka 'const unsigned int'} [-Wformat=]
perl.h:4613:46: note: in definition of macro 'DEBUG__'
locale.c:1193:5: note: in expansion of macro 'DEBUG_Lv'
locale.c:1194:26: warning: too many arguments for format [-Wformat-extra-args]
handy.h:719:25: warning: 'previous_start' may be used uninitialized in this function [-Wmaybe-uninitialized]
locale.c:701:12: note: 'previous_start' was declared here
ListUtil.c: In function 'XS_List__Util_reduce':
../../embed.h:66:23: warning: 'retvals' may be used uninitialized in this function [-Wmaybe-uninitialized]
ListUtil.xs:530:9: note: 'retvals' was declared here

Non-Fatal messages(gcc):



-- 
Report by Test::Smoke v1.71 running on perl 5.30.2
(Reporter v0.053 / Smoker v0.046)

Thread Next


nntp.perl.org: Perl Programming lists via nntp and http.
Comments to Ask Bjørn Hansen at ask@perl.org | Group listing | About