develooper Front page | perl.daily-build.reports | Postings from February 2021

Smoke [blead] v5.33.6-141-g5d273abb14 FAIL(F) linux4.15.0-135-generic [Ubuntu 18.04.5 LTS (x86_64/1 cpu)

Thread Previous
From:
Carlos Guevara
Date:
February 22, 2021 21:29
Subject:
Smoke [blead] v5.33.6-141-g5d273abb14 FAIL(F) linux4.15.0-135-generic [Ubuntu 18.04.5 LTS (x86_64/1 cpu)
Message ID:
20210222212854.BB5C2144748@cjg-bionic
Automated smoke report for branch blead 5.33.8 patch 5d273abb14ecf2af8a75115442c938b8a5979ebe v5.33.6-141-g5d273abb14
cjg-bionic: Intel(R) Xeon(R) CPU E5-2620 v2 @ 2.10GHz (GenuineIntel 2068MHz) (x86_64/1 cpu)
    on        linux - 4.15.0-135-generic [Ubuntu 18.04.5 LTS (bionic)]
    using     gcc version 7.5.0
    smoketime 6 hours 41 minutes (average 33 minutes 27 seconds)

Summary: FAIL(F)

O = OK  F = Failure(s), extended report at the bottom
X = Failure(s) under TEST but not under harness
? = still running or test results not (yet) available
Build failures during:       - = unknown or N/A
c = Configure, m = make, M = make (after miniperl), t = make test-prep

v5.33.6-141-g5d273abb14  Configuration (common) -Dcc=gcc
----------- ---------------------------------------------------------
F O         
F F         -Duse64bitall
F O         -Dusequadmath
O F         -Duseithreads
O O         -Duseithreads -Duse64bitall
F F         -Duseithreads -Dusequadmath
| +--------- -DDEBUGGING
+----------- no debugging


Testsuite was run only with 'harness'

Tests skipped on user request:
    # One test name on a line
Failures: (common-args) -Dcc=gcc
[default] 
../dist/Time-HiRes/t/usleep.t...............................FAILED
    3
    Non-zero exit status: 1

[default] -Duse64bitall
[default] -Duseithreads -Dusequadmath
../dist/Time-HiRes/t/usleep.t...............................FAILED
    6
    Non-zero exit status: 1

[default] -DDEBUGGING -Duse64bitall
../cpan/ExtUtils-MakeMaker/t/eu_command.t...................FAILED
    8
    Non-zero exit status: 1

[default] -Dusequadmath
../cpan/ExtUtils-Constant/t/Constant.t......................FAILED
    33
    Bad plan.  You planned 302 tests but ran 33.

[default] -DDEBUGGING -Duseithreads
../dist/Time-HiRes/t/alarm.t................................FAILED
    2
    Non-zero exit status: 1

[default] -DDEBUGGING -Duseithreads -Dusequadmath
../dist/Time-HiRes/t/usleep.t...............................FAILED
    5
    Non-zero exit status: 1

MANIFEST did not declare '.mailmap'

Compiler messages(gcc):


Non-Fatal messages(gcc):



-- 
Report by Test::Smoke v1.71 running on perl 5.26.1
(Reporter v0.053 / Smoker v0.046)

Thread Previous


nntp.perl.org: Perl Programming lists via nntp and http.
Comments to Ask Bjørn Hansen at ask@perl.org | Group listing | About