develooper Front page | perl.daily-build.reports | Postings from February 2021

Smoke [blead] v5.33.6-140-gb3a019b423 PASS netbsd 9.1 (amd64/1 cpu)

Thread Previous
From:
Carlos Guevara
Date:
February 21, 2021 18:55
Subject:
Smoke [blead] v5.33.6-140-gb3a019b423 PASS netbsd 9.1 (amd64/1 cpu)
Message ID:
20210221185446.9DD3B3987CE@cjg-netbsd9
Automated smoke report for branch blead 5.33.8 patch b3a019b423725caa4eb6a8615a6c1367b85326b0 v5.33.6-140-gb3a019b423
cjg-netbsd9: Intel 686-class (amd64/1 cpu)
    on        netbsd - 9.1
    using     gcc version 7.5.0
    smoketime 5 hours 15 minutes (average 39 minutes 28 seconds)

Summary: PASS

O = OK  F = Failure(s), extended report at the bottom
X = Failure(s) under TEST but not under harness
? = still running or test results not (yet) available
Build failures during:       - = unknown or N/A
c = Configure, m = make, M = make (after miniperl), t = make test-prep

v5.33.6-140-gb3a019b423  Configuration (common) -Dcc=gcc
----------- ---------------------------------------------------------
O O         
O O         -Duse64bitall
O O         -Duseithreads
O O         -Duseithreads -Duse64bitall
| +--------- -DDEBUGGING
+----------- no debugging


Testsuite was run only with 'harness'

Tests skipped on user request:
    # One test name on a line
MANIFEST did not declare '.mailmap'

Compiler messages(gcc):
/usr/include/sys/cdefs_elf.h:67:20: error: missing binary operator before token "("
/usr/include/sys/cdefs_elf.h:73:20: error: missing binary operator before token "("
/usr/include/sys/cdefs_elf.h:79:20: error: missing binary operator before token "("
DB_File.xs: In function 'ParseOpenInfo':
DB_File.xs:476:44: warning: suggest braces around empty body in an 'if' statement [-Wempty-body]
DB_File.xs:1044:13: note: in expansion of macro 'croak_and_free'
DB_File.xs:1050:13: note: in expansion of macro 'croak_and_free'
DB_File.xs:1056:17: note: in expansion of macro 'croak_and_free'
DB_File.xs:1091:17: note: in expansion of macro 'croak_and_free'
DB_File.xs:1140:17: note: in expansion of macro 'croak_and_free'
DB_File.xs:1229:13: note: in expansion of macro 'croak_and_free'
Socket.c: In function 'XS_Socket_pack_ip_mreq_source':
Socket.c:1694:7: warning: variable 'interface' set but not used [-Wunused-but-set-variable]
const-c.inc: In function 'constant_19':
const-c.inc:351:42: warning: unused parameter 'iv_return' [-Wunused-parameter]
Piece.xs: In function '_strptime':
Piece.xs:719:8: warning: 'len' may be used uninitialized in this function [-Wmaybe-uninitialized]
re_exec.c: In function 'S_regtry':
re_exec.c:7056:30: warning: 'fold_array' may be used uninitialized in this function [-Wmaybe-uninitialized]
re_exec.c:6960:17: note: 'fold_array' was declared here
re_exec.c:7062:22: warning: 'folder' may be used uninitialized in this function [-Wmaybe-uninitialized]
re_exec.c:6959:16: note: 'folder' was declared here
regexec.c: In function 'S_regtry':
regexec.c:7056:30: warning: 'fold_array' may be used uninitialized in this function [-Wmaybe-uninitialized]
regexec.c:6960:17: note: 'fold_array' was declared here
regexec.c:7062:22: warning: 'folder' may be used uninitialized in this function [-Wmaybe-uninitialized]
regexec.c:6959:16: note: 'folder' was declared here

Non-Fatal messages(gcc):



-- 
Report by Test::Smoke v1.71 running on perl 5.30.2
(Reporter v0.053 / Smoker v0.046)

Thread Previous


nntp.perl.org: Perl Programming lists via nntp and http.
Comments to Ask Bjørn Hansen at ask@perl.org | Group listing | About