develooper Front page | perl.daily-build.reports | Postings from February 2021

Smoke [blead] v5.33.6-138-gf1bf079f5f FAIL(F) linux 4.4.240[Slackware 14.2] (x86_64/1 cpu)

From:
Carlos Guevara
Date:
February 21, 2021 15:27
Subject:
Smoke [blead] v5.33.6-138-gf1bf079f5f FAIL(F) linux 4.4.240[Slackware 14.2] (x86_64/1 cpu)
Message ID:
202102211526.11LFQwYa030953@cjg-slackware14
Automated smoke report for branch blead 5.33.8 patch f1bf079f5ffcef6c6cc3eed62b84949770fa03e9 v5.33.6-138-gf1bf079f5f
cjg-slackware14: Intel(R) Xeon(R) CPU E5-2620 v2 @ 2.10GHz (GenuineIntel 2069MHz) (x86_64/1 cpu)
    on        linux - 4.4.240 [Slackware 14.2]
    using     gcc version 5.5.0
    smoketime 6 hours 49 minutes (average 34 minutes 6 seconds)

Summary: FAIL(F)

O = OK  F = Failure(s), extended report at the bottom
X = Failure(s) under TEST but not under harness
? = still running or test results not (yet) available
Build failures during:       - = unknown or N/A
c = Configure, m = make, M = make (after miniperl), t = make test-prep

v5.33.6-138-gf1bf079f5f  Configuration (common) -Dcc=gcc
----------- ---------------------------------------------------------
F F         
F F         -Duse64bitall
F F         -Dusequadmath
F F         -Duseithreads
F F         -Duseithreads -Duse64bitall
F F         -Duseithreads -Dusequadmath
| +--------- -DDEBUGGING
+----------- no debugging


Testsuite was run only with 'harness'

Tests skipped on user request:
    # One test name on a line
Failures: (common-args) -Dcc=gcc
[default] 
[default] -DDEBUGGING
[default] -Duse64bitall
[default] -DDEBUGGING -Duse64bitall
[default] -Dusequadmath
[default] -DDEBUGGING -Dusequadmath
[default] -Duseithreads
[default] -DDEBUGGING -Duseithreads
[default] -Duseithreads -Duse64bitall
[default] -DDEBUGGING -Duseithreads -Duse64bitall
[default] -Duseithreads -Dusequadmath
[default] -DDEBUGGING -Duseithreads -Dusequadmath
../t/porting/corelist.t.....................................FAILED
    3-5
../dist/Module-CoreList/t/is_core.t.........................FAILED
    2, 11
    Non-zero exit status: 2
../dist/Module-CoreList/t/maintainer.t......................FAILED
    4-5
    Non-zero exit status: 2

MANIFEST did not declare '.mailmap'

Compiler messages(gcc):
GDBM_File.xs: In function 'XS_GDBM_File_syserrno':
GDBM_File.xs:120:64: warning: right-hand operand of comma expression has no effect [-Wunused-value]
GDBM_File.xs:426:9: note: in expansion of macro 'not_here'
re_exec.c: In function 'S_regtry':
re_exec.c:7056:30: warning: 'fold_array' may be used uninitialized in this function [-Wmaybe-uninitialized]
re_exec.c:6960:17: note: 'fold_array' was declared here
re_exec.c:7062:22: warning: 'folder' may be used uninitialized in this function [-Wmaybe-uninitialized]
re_exec.c:6959:16: note: 'folder' was declared here

Non-Fatal messages(gcc):



-- 
Report by Test::Smoke v1.71 running on perl 5.26.1
(Reporter v0.053 / Smoker v0.046)



nntp.perl.org: Perl Programming lists via nntp and http.
Comments to Ask Bjørn Hansen at ask@perl.org | Group listing | About