develooper Front page | perl.daily-build.reports | Postings from February 2021

Smoke [blead] v5.33.6-136-gbc9a5de2cb FAIL(F) linux 5.10.0-3-arm64[Debian GNU/Linux bullseye/sid] (aarch64/4 cpu)

From:
gregor herrmann
Date:
February 21, 2021 15:09
Subject:
Smoke [blead] v5.33.6-136-gbc9a5de2cb FAIL(F) linux 5.10.0-3-arm64[Debian GNU/Linux bullseye/sid] (aarch64/4 cpu)
Message ID:
E1lDqMU-0004lW-MM@7of9.comodo.priv.at
Automated smoke report for branch blead 5.33.8 patch bc9a5de2cbd0b7751c2d9f89e3c1dae4474d7e00 v5.33.6-136-gbc9a5de2cb
7of9:  (aarch64/4 cpu)
    on        linux - 5.10.0-3-arm64 [Debian GNU/Linux bullseye/sid]
    using     cc version 10.2.1 20210110
    smoketime 1 day 2 hours 33 minutes (average 3 hours 19 minutes)

Summary: FAIL(F)

O = OK  F = Failure(s), extended report at the bottom
X = Failure(s) under TEST but not under harness
? = still running or test results not (yet) available
Build failures during:       - = unknown or N/A
c = Configure, m = make, M = make (after miniperl), t = make test-prep

v5.33.6-136-gbc9a5de2cb  Configuration (common) none
----------- ---------------------------------------------------------
F F F F F F 
F F F F F F -Duse64bitint
F F F F F F -Duseithreads
F F F F F F -Duseithreads -Duse64bitint
| | | | | +- LC_ALL = C.UTF-8 -DDEBUGGING
| | | | +--- PERLIO = perlio -DDEBUGGING
| | | +----- PERLIO = stdio  -DDEBUGGING
| | +------- LC_ALL = C.UTF-8
| +--------- PERLIO = perlio
+----------- PERLIO = stdio 

Testsuite was run only with 'harness' and HARNESS_OPTIONS=j5

Tests skipped on user request:
    # One test name on a line
Failures: (common-args) none
[stdio] 
../t/porting/corelist.t.....................................FAILED
    3-5
../cpan/Socket/t/getaddrinfo.t..............................FAILED
    22-23
    Non-zero exit status: 2
../dist/Module-CoreList/t/maintainer.t......................FAILED
    4-5
    Non-zero exit status: 2
../dist/Module-CoreList/t/is_core.t.........................FAILED
    2, 11
    Non-zero exit status: 2

[perlio/C.UTF-8] 
[stdio/perlio/C.UTF-8] -DDEBUGGING
[stdio/C.UTF-8] -Duse64bitint
[stdio/C.UTF-8] -DDEBUGGING -Duse64bitint
[stdio] -Duseithreads
[stdio/C.UTF-8] -DDEBUGGING -Duseithreads
[stdio/C.UTF-8] -Duseithreads -Duse64bitint
[stdio/perlio/C.UTF-8] -DDEBUGGING -Duseithreads -Duse64bitint
../t/porting/corelist.t.....................................FAILED
    3-5
../dist/Module-CoreList/t/is_core.t.........................FAILED
    2, 11
    Non-zero exit status: 2
../dist/Module-CoreList/t/maintainer.t......................FAILED
    4-5
    Non-zero exit status: 2

[perlio] -Duse64bitint
[perlio] -DDEBUGGING -Duse64bitint
[perlio/C.UTF-8] -Duseithreads
[perlio] -DDEBUGGING -Duseithreads
[perlio] -Duseithreads -Duse64bitint
../t/porting/corelist.t.....................................FAILED
    3-5
../dist/Module-CoreList/t/maintainer.t......................FAILED
    4-5
    Non-zero exit status: 2
../dist/Module-CoreList/t/is_core.t.........................FAILED
    2, 11
    Non-zero exit status: 2

MANIFEST did not declare '.mailmap'

Compiler messages(gcc):
makefile:258: warning: ignoring prerequisites on suffix rule definition
makefile:254: warning: ignoring prerequisites on suffix rule definition

Non-Fatal messages(gcc):



-- 
Report by Test::Smoke v1.78 running on perl 5.32.1
(Reporter v0.054 / Smoker v0.046)



nntp.perl.org: Perl Programming lists via nntp and http.
Comments to Ask Bjørn Hansen at ask@perl.org | Group listing | About