develooper Front page | perl.daily-build.reports | Postings from February 2021

Smoke [blead] v5.33.6-138-gf1bf079f5f FAIL(F) linux4.15.0-135-generic [Ubuntu 18.04.5 LTS (x86_64/1 cpu)

From:
Carlos Guevara
Date:
February 21, 2021 14:50
Subject:
Smoke [blead] v5.33.6-138-gf1bf079f5f FAIL(F) linux4.15.0-135-generic [Ubuntu 18.04.5 LTS (x86_64/1 cpu)
Message ID:
20210221144954.E5C6F14473F@cjg-bionic
Automated smoke report for branch blead 5.33.8 patch f1bf079f5ffcef6c6cc3eed62b84949770fa03e9 v5.33.6-138-gf1bf079f5f
cjg-bionic: Intel(R) Xeon(R) CPU E5-2620 v2 @ 2.10GHz (GenuineIntel 2068MHz) (x86_64/1 cpu)
    on        linux - 4.15.0-135-generic [Ubuntu 18.04.5 LTS (bionic)]
    using     gcc version 7.5.0
    smoketime 6 hours 39 minutes (average 33 minutes 16 seconds)

Summary: FAIL(F)

O = OK  F = Failure(s), extended report at the bottom
X = Failure(s) under TEST but not under harness
? = still running or test results not (yet) available
Build failures during:       - = unknown or N/A
c = Configure, m = make, M = make (after miniperl), t = make test-prep

v5.33.6-138-gf1bf079f5f  Configuration (common) -Dcc=gcc
----------- ---------------------------------------------------------
F F         
F F         -Duse64bitall
F F         -Dusequadmath
F F         -Duseithreads
F F         -Duseithreads -Duse64bitall
F F         -Duseithreads -Dusequadmath
| +--------- -DDEBUGGING
+----------- no debugging


Testsuite was run only with 'harness'

Tests skipped on user request:
    # One test name on a line
Failures: (common-args) -Dcc=gcc
[default] 
../t/porting/corelist.t.....................................FAILED
    3-5
../dist/Module-CoreList/t/is_core.t.........................FAILED
    2, 11
    Non-zero exit status: 2
../dist/Module-CoreList/t/maintainer.t......................FAILED
    4-5
    Non-zero exit status: 2
../dist/Time-HiRes/t/alarm.t................................FAILED
    2
    Non-zero exit status: 1

[default] -DDEBUGGING
../t/porting/corelist.t.....................................FAILED
    3-5
../cpan/ExtUtils-Constant/t/Constant.t......................FAILED
    33
    Bad plan.  You planned 302 tests but ran 33.
../dist/Module-CoreList/t/is_core.t.........................FAILED
    2, 11
    Non-zero exit status: 2
../dist/Module-CoreList/t/maintainer.t......................FAILED
    4-5
    Non-zero exit status: 2

[default] -Duse64bitall
../t/porting/corelist.t.....................................FAILED
    3-5
../dist/Module-CoreList/t/is_core.t.........................FAILED
    2, 11
    Non-zero exit status: 2
../dist/Module-CoreList/t/maintainer.t......................FAILED
    4-5
    Non-zero exit status: 2
../dist/Time-HiRes/t/ualarm.t...............................FAILED
    9-10
    Non-zero exit status: 2

[default] -DDEBUGGING -Duse64bitall
[default] -Dusequadmath
[default] -DDEBUGGING -Dusequadmath
[default] -DDEBUGGING -Duseithreads
[default] -Duseithreads -Duse64bitall
../t/porting/corelist.t.....................................FAILED
    3-5
../dist/Module-CoreList/t/is_core.t.........................FAILED
    2, 11
    Non-zero exit status: 2
../dist/Module-CoreList/t/maintainer.t......................FAILED
    4-5
    Non-zero exit status: 2

[default] -Duseithreads
../t/porting/corelist.t.....................................FAILED
    3-5
../dist/Module-CoreList/t/is_core.t.........................FAILED
    2, 11
    Non-zero exit status: 2
../dist/Module-CoreList/t/maintainer.t......................FAILED
    4-5
    Non-zero exit status: 2
../dist/Time-HiRes/t/usleep.t...............................FAILED
    6
    Non-zero exit status: 1

[default] -DDEBUGGING -Duseithreads -Duse64bitall
../t/porting/corelist.t.....................................FAILED
    3-5
../dist/Module-CoreList/t/is_core.t.........................FAILED
    2, 11
    Non-zero exit status: 2
../dist/Module-CoreList/t/maintainer.t......................FAILED
    4-5
    Non-zero exit status: 2
../dist/Time-HiRes/t/usleep.t...............................FAILED
    4
    Non-zero exit status: 1

[default] -Duseithreads -Dusequadmath
../t/porting/corelist.t.....................................FAILED
    3-5
../dist/Module-CoreList/t/is_core.t.........................FAILED
    2, 11
    Non-zero exit status: 2
../dist/Module-CoreList/t/maintainer.t......................FAILED
    4-5
    Non-zero exit status: 2
../dist/Time-HiRes/t/usleep.t...............................FAILED
    5
    Non-zero exit status: 1

[default] -DDEBUGGING -Duseithreads -Dusequadmath
../t/porting/corelist.t.....................................FAILED
    3-5
../cpan/ExtUtils-MakeMaker/t/eu_command.t...................FAILED
    8
    Non-zero exit status: 1
../dist/Module-CoreList/t/is_core.t.........................FAILED
    2, 11
    Non-zero exit status: 2
../dist/Module-CoreList/t/maintainer.t......................FAILED
    4-5
    Non-zero exit status: 2

MANIFEST did not declare '.mailmap'

Compiler messages(gcc):


Non-Fatal messages(gcc):



-- 
Report by Test::Smoke v1.71 running on perl 5.26.1
(Reporter v0.053 / Smoker v0.046)



nntp.perl.org: Perl Programming lists via nntp and http.
Comments to Ask Bjørn Hansen at ask@perl.org | Group listing | About