develooper Front page | perl.daily-build.reports | Postings from February 2021

Smoke [blead] v5.33.6-138-gf1bf079f5f FAIL(F) linux 4.19.0-14-amd64[Debian GNU/Linux 10.8 (x86_64/1 cpu)

From:
Carlos Guevara
Date:
February 21, 2021 13:21
Subject:
Smoke [blead] v5.33.6-138-gf1bf079f5f FAIL(F) linux 4.19.0-14-amd64[Debian GNU/Linux 10.8 (x86_64/1 cpu)
Message ID:
E1lDogF-0001NA-0x@cjg-buster
Automated smoke report for branch blead 5.33.8 patch f1bf079f5ffcef6c6cc3eed62b84949770fa03e9 v5.33.6-138-gf1bf079f5f
cjg-buster: Intel(R) Xeon(R) CPU E5-2620 v2 @ 2.10GHz (GenuineIntel 2068MHz) (x86_64/1 cpu)
    on        linux - 4.19.0-14-amd64 [Debian GNU/Linux 10.8 (buster)]
    using     g++ version 8.3.0
    smoketime 6 hours 59 minutes (average 34 minutes 59 seconds)

Summary: FAIL(F)

O = OK  F = Failure(s), extended report at the bottom
X = Failure(s) under TEST but not under harness
? = still running or test results not (yet) available
Build failures during:       - = unknown or N/A
c = Configure, m = make, M = make (after miniperl), t = make test-prep

v5.33.6-138-gf1bf079f5f  Configuration (common) -Dcc=g++
----------- ---------------------------------------------------------
F F         
F F         -Duse64bitall
F F         -Dusequadmath
F F         -Duseithreads
F F         -Duseithreads -Duse64bitall
F F         -Duseithreads -Dusequadmath
| +--------- -DDEBUGGING
+----------- no debugging


Testsuite was run only with 'harness'

Tests skipped on user request:
    # One test name on a line
Failures: (common-args) -Dcc=g++
[default] 
[default] -DDEBUGGING -Duseithreads -Dusequadmath
../t/porting/corelist.t.....................................FAILED
    3-5
../dist/Module-CoreList/t/is_core.t.........................FAILED
    2, 11
    Non-zero exit status: 2
../dist/Module-CoreList/t/maintainer.t......................FAILED
    4-5
    Non-zero exit status: 2
../dist/Time-HiRes/t/nanosleep.t............................FAILED
    3
    Non-zero exit status: 1

[default] -DDEBUGGING
../t/porting/corelist.t.....................................FAILED
    3-5
../dist/Module-CoreList/t/is_core.t.........................FAILED
    2, 11
    Non-zero exit status: 2
../dist/Module-CoreList/t/maintainer.t......................FAILED
    4-5
    Non-zero exit status: 2
../dist/Time-HiRes/t/usleep.t...............................FAILED
    5
    Non-zero exit status: 1

[default] -Duse64bitall
../t/porting/corelist.t.....................................FAILED
    3-5
../dist/Module-CoreList/t/is_core.t.........................FAILED
    2, 11
    Non-zero exit status: 2
../dist/Module-CoreList/t/maintainer.t......................FAILED
    4-5
    Non-zero exit status: 2
../dist/Time-HiRes/t/ualarm.t...............................FAILED
    9-10
    Non-zero exit status: 2

[default] -DDEBUGGING -Duse64bitall
[default] -DDEBUGGING -Dusequadmath
[default] -Duseithreads
[default] -Duseithreads -Duse64bitall
[default] -DDEBUGGING -Duseithreads -Duse64bitall
../t/porting/corelist.t.....................................FAILED
    3-5
../dist/Module-CoreList/t/is_core.t.........................FAILED
    2, 11
    Non-zero exit status: 2
../dist/Module-CoreList/t/maintainer.t......................FAILED
    4-5
    Non-zero exit status: 2

[default] -Dusequadmath
../t/porting/corelist.t.....................................FAILED
    3-5
../cpan/ExtUtils-Constant/t/Constant.t......................FAILED
    63
    Bad plan.  You planned 302 tests but ran 63.
../dist/Module-CoreList/t/is_core.t.........................FAILED
    2, 11
    Non-zero exit status: 2
../dist/Module-CoreList/t/maintainer.t......................FAILED
    4-5
    Non-zero exit status: 2

[default] -DDEBUGGING -Duseithreads
../t/porting/corelist.t.....................................FAILED
    3-5
../dist/IO/t/io_poll.t......................................FAILED
    12
../dist/Module-CoreList/t/is_core.t.........................FAILED
    2, 11
    Non-zero exit status: 2
../dist/Module-CoreList/t/maintainer.t......................FAILED
    4-5
    Non-zero exit status: 2

[default] -Duseithreads -Dusequadmath
../t/porting/corelist.t.....................................FAILED
    3-5
../cpan/ExtUtils-Constant/t/Constant.t......................FAILED
    259
    Bad plan.  You planned 302 tests but ran 259.
../dist/Module-CoreList/t/is_core.t.........................FAILED
    2, 11
    Non-zero exit status: 2
../dist/Module-CoreList/t/maintainer.t......................FAILED
    4-5
    Non-zero exit status: 2

MANIFEST did not declare '.mailmap'

Compiler messages(gcc):
mg.c: In function 'int Perl_magic_set(SV*, MAGIC*)':
mg.c:2855:50: warning: type qualifiers ignored on cast result type [-Wignored-qualifiers]
regexp.h:527:45: note: in definition of macro 'RXp_ENGINE'
regexp.h:528:55: note: in expansion of macro 'ReANY'
perl.h:235:5: note: in expansion of macro 'RX_ENGINE'
mg.c:2855:13: note: in expansion of macro 'CALLREG_NUMBUF_STORE'
perl.h:235:47: note: in definition of macro 'CALLREG_NUMBUF_STORE'
inflate.c: In function 'int inflate(z_streamp, int)':
inflate.c:724:25: warning: this statement may fall through [-Wimplicit-fallthrough=]
inflate.c:725:9: note: here
inflate.c:732:25: warning: this statement may fall through [-Wimplicit-fallthrough=]
inflate.c:733:9: note: here
inflate.c:947:25: warning: this statement may fall through [-Wimplicit-fallthrough=]
inflate.c:948:9: note: here
inflate.c:968:25: warning: this statement may fall through [-Wimplicit-fallthrough=]
inflate.c:969:9: note: here
MD5.xs: In function 'MD5_CTX* get_md5_ctx(SV*)':
MD5.xs:470:50: warning: type qualifiers ignored on cast result type [-Wignored-qualifiers]
MD5.xs: In function 'SV* new_md5_ctx(MD5_CTX*, const char*)':
MD5.xs:492:63: warning: type qualifiers ignored on cast result type [-Wignored-qualifiers]
../../embed.h:623:63: note: in definition of macro 'sv_magicext'
Socket.xs: In function 'void XS_Socket_inet_aton(CV*)':
Socket.xs:769:28: warning: missing initializer for member 'addrinfo::ai_family' [-Wmissing-field-initializers]
Socket.xs:769:28: warning: missing initializer for member 'addrinfo::ai_socktype' [-Wmissing-field-initializers]
Socket.xs:769:28: warning: missing initializer for member 'addrinfo::ai_protocol' [-Wmissing-field-initializers]
Socket.xs:769:28: warning: missing initializer for member 'addrinfo::ai_addrlen' [-Wmissing-field-initializers]
Socket.xs:769:28: warning: missing initializer for member 'addrinfo::ai_addr' [-Wmissing-field-initializers]
Socket.xs:769:28: warning: missing initializer for member 'addrinfo::ai_canonname' [-Wmissing-field-initializers]
Socket.xs:769:28: warning: missing initializer for member 'addrinfo::ai_next' [-Wmissing-field-initializers]
HiRes.xs: In function 'void XS_Time__HiRes_setitimer(CV*)':
HiRes.xs:1248:42: warning: option '-Wc++-compat' is valid for C/ObjC but not for C++ [-Wpragmas]
HiRes.xs: In function 'void XS_Time__HiRes_getitimer(CV*)':
HiRes.xs:1268:42: warning: option '-Wc++-compat' is valid for C/ObjC but not for C++ [-Wpragmas]
../../embed.h: In function 'void XS_List__Util_reduce(CV*)':
../../embed.h:66:35: warning: 'retvals' may be used uninitialized in this function [-Wmaybe-uninitialized]
ListUtil.xs:530:9: note: 'retvals' was declared here
mg.c: In function 'int Perl_magic_set(PerlInterpreter*, SV*, MAGIC*)':
MD5.xs: In function 'MD5_CTX* get_md5_ctx(PerlInterpreter*, SV*)':
MD5.xs: In function 'SV* new_md5_ctx(PerlInterpreter*, MD5_CTX*, const char*)':
Socket.xs: In function 'void XS_Socket_inet_aton(PerlInterpreter*, CV*)':
HiRes.xs: In function 'void XS_Time__HiRes_setitimer(PerlInterpreter*, CV*)':
HiRes.xs: In function 'void XS_Time__HiRes_getitimer(PerlInterpreter*, CV*)':
../../embed.h: In function 'void XS_List__Util_reduce(PerlInterpreter*, CV*)':

Non-Fatal messages(gcc):



-- 
Report by Test::Smoke v1.71 running on perl 5.26.1
(Reporter v0.053 / Smoker v0.046)



nntp.perl.org: Perl Programming lists via nntp and http.
Comments to Ask Bjørn Hansen at ask@perl.org | Group listing | About