develooper Front page | perl.daily-build.reports | Postings from February 2021

Smoke [blead] v5.33.6-137-gc2daba311f FAIL(F) Solaris 2.11 (i386/1cpu)

Thread Next
From:
Carlos Guevara
Date:
February 21, 2021 00:08
Subject:
Smoke [blead] v5.33.6-137-gc2daba311f FAIL(F) Solaris 2.11 (i386/1cpu)
Message ID:
6031a46c.3ac72.ae1f60@cjg-omniosce
Automated smoke report for branch blead 5.33.8 patch c2daba311fa72a806caf9e6aea0531115d174412 v5.33.6-137-gc2daba311f
cjg-omniosce: i86pc (2050MHz) (i386/1 cpu)
    on        Solaris - 2.11
    using     gcc version 7.4.0
    smoketime 9 hours 5 minutes (average 45 minutes 28 seconds)

Summary: FAIL(F)

O = OK  F = Failure(s), extended report at the bottom
X = Failure(s) under TEST but not under harness
? = still running or test results not (yet) available
Build failures during:       - = unknown or N/A
c = Configure, m = make, M = make (after miniperl), t = make test-prep

v5.33.6-137-gc2daba311f  Configuration (common) -Dcc=gcc
----------- ---------------------------------------------------------
F F         
F F         -Duse64bitall
F F         -Duselongdouble
F F         -Duseithreads
F F         -Duseithreads -Duse64bitall
F F         -Duseithreads -Duselongdouble
| +--------- -DDEBUGGING
+----------- no debugging


Testsuite was run only with 'harness'

Tests skipped on user request:
    # One test name on a line
Failures: (common-args) -Dcc=gcc
[default] 
[default] -DDEBUGGING
[default] -Duse64bitall
[default] -DDEBUGGING -Duse64bitall
[default] -Duselongdouble
[default] -DDEBUGGING -Duselongdouble
[default] -Duseithreads
[default] -DDEBUGGING -Duseithreads
[default] -Duseithreads -Duse64bitall
[default] -DDEBUGGING -Duseithreads -Duse64bitall
[default] -Duseithreads -Duselongdouble
[default] -DDEBUGGING -Duseithreads -Duselongdouble
../t/porting/corelist.t.....................................FAILED
    3-5
../dist/Module-CoreList/t/is_core.t.........................FAILED
    2, 11
    Non-zero exit status: 2
../dist/Module-CoreList/t/maintainer.t......................FAILED
    4-5
    Non-zero exit status: 2

MANIFEST did not declare '.mailmap'

Compiler messages(gcc):
scope.c: In function 'Perl_leave_scope':
scope.c:1389:33: warning: 'a2.any_ptr' may be used uninitialized in this function [-Wmaybe-uninitialized]
regexec.c: In function 'S_setup_EXACTISH_ST':
regexec.c:4857:38: warning: array subscript has type 'char' [-Wchar-subscripts]
embed.h:752:85: note: in definition of macro 'uvoffuni_to_utf8_flags_msgs'
utf8.h:60:37: note: in expansion of macro 'uvchr_to_utf8_flags_msgs'
utf8.h:58:37: note: in expansion of macro 'uvchr_to_utf8_flags'
regexec.c:4857:17: note: in expansion of macro 'uvchr_to_utf8'
regexec.c:4858:24: warning: array subscript has type 'char' [-Wchar-subscripts]
regexec.c:4867:24: warning: array subscript has type 'char' [-Wchar-subscripts]
regexec.c:4868:24: warning: array subscript has type 'char' [-Wchar-subscripts]
regexec.c: In function 'S_regrepeat':
regexec.c:10081:44: warning: array subscript has type 'char' [-Wchar-subscripts]
handy.h:719:78: note: in definition of macro 'memEQ'
regexec.c:10086:45: warning: array subscript has type 'char' [-Wchar-subscripts]
regexec.c:10098:38: warning: array subscript has type 'char' [-Wchar-subscripts]
regexec.c:10116:55: warning: array subscript has type 'char' [-Wchar-subscripts]
regexec.c:10120:41: warning: array subscript has type 'char' [-Wchar-subscripts]
regexec.c:10127:34: warning: array subscript has type 'char' [-Wchar-subscripts]
Cwd.xs:23:0: warning: "SYSNAME" redefined
/usr/include/sys/param.h:184:0: note: this is the location of the previous definition
SysV.xs: In function 'XS_IPC__SysV_shmdt':
SysV.xs:417:20: warning: request for implicit conversion from 'void *' to 'char *' not permitted in C++ [-Wc++-compat]
ODBM_File.xs:24:5: warning: identifier 'delete' conflicts with C++ keyword [-Wc++-compat]
const-c.inc: In function 'constant_19':
const-c.inc:351:42: warning: unused parameter 'iv_return' [-Wunused-parameter]
re_exec.c: In function 'S_dump_exec_pos':
re_exec.c:4401:21: warning: format '%u' expects argument of type 'unsigned int', but argument 12 has type 'U32 {aka const long unsigned int}' [-Wformat=]
re_exec.c:4401:55: note: format string is defined here
re_exec.c: In function 'S_setup_EXACTISH_ST':
re_exec.c:4857:38: warning: array subscript has type 'char' [-Wchar-subscripts]
../../embed.h:752:85: note: in definition of macro 'uvoffuni_to_utf8_flags_msgs'
../../utf8.h:60:37: note: in expansion of macro 'uvchr_to_utf8_flags_msgs'
../../utf8.h:58:37: note: in expansion of macro 'uvchr_to_utf8_flags'
re_exec.c:4857:17: note: in expansion of macro 'uvchr_to_utf8'
re_exec.c:4858:24: warning: array subscript has type 'char' [-Wchar-subscripts]
re_exec.c:4867:24: warning: array subscript has type 'char' [-Wchar-subscripts]
re_exec.c:4868:24: warning: array subscript has type 'char' [-Wchar-subscripts]
re_exec.c: In function 'S_regrepeat':
re_exec.c:10081:44: warning: array subscript has type 'char' [-Wchar-subscripts]
../../handy.h:719:78: note: in definition of macro 'memEQ'
re_exec.c:10086:45: warning: array subscript has type 'char' [-Wchar-subscripts]
re_exec.c:10098:38: warning: array subscript has type 'char' [-Wchar-subscripts]
re_exec.c:10116:55: warning: array subscript has type 'char' [-Wchar-subscripts]
re_exec.c:10120:41: warning: array subscript has type 'char' [-Wchar-subscripts]
re_exec.c:10127:34: warning: array subscript has type 'char' [-Wchar-subscripts]
re_exec.c: In function 'S_regtry':
re_exec.c:7056:30: warning: 'fold_array' may be used uninitialized in this function [-Wmaybe-uninitialized]
re_exec.c:6960:17: note: 'fold_array' was declared here
re_exec.c:7062:22: warning: 'folder' may be used uninitialized in this function [-Wmaybe-uninitialized]
re_exec.c:6959:16: note: 'folder' was declared here
re_comp.c: In function 'S_ssc_is_cp_posixl_init':
re_comp.c:1625:11: warning: 'end' may be used uninitialized in this function [-Wmaybe-uninitialized]
re_comp.c:1624:11: warning: 'start' may be used uninitialized in this function [-Wmaybe-uninitialized]
re_comp.c: In function 'S_ssc_and':
re_comp.c:1558:11: warning: 'end' may be used uninitialized in this function [-Wmaybe-uninitialized]
re_comp.c:1543:15: note: 'end' was declared here
re_comp.c:1557:11: warning: 'start' may be used uninitialized in this function [-Wmaybe-uninitialized]
re_comp.c:1543:8: note: 'start' was declared here
regcomp.c: In function 'S_ssc_is_cp_posixl_init':
regcomp.c:1625:11: warning: 'end' may be used uninitialized in this function [-Wmaybe-uninitialized]
regcomp.c:1624:11: warning: 'start' may be used uninitialized in this function [-Wmaybe-uninitialized]
regcomp.c: In function 'S_ssc_and':
regcomp.c:1558:11: warning: 'end' may be used uninitialized in this function [-Wmaybe-uninitialized]
regcomp.c:1543:15: note: 'end' was declared here
regcomp.c:1557:11: warning: 'start' may be used uninitialized in this function [-Wmaybe-uninitialized]
regcomp.c:1543:8: note: 'start' was declared here
regexec.c: In function 'S_dump_exec_pos':
regexec.c:4401:21: warning: format '%u' expects argument of type 'unsigned int', but argument 12 has type 'U32 {aka const long unsigned int}' [-Wformat=]
regexec.c:4401:55: note: format string is defined here
regexec.c: In function 'S_regtry':
regexec.c:7056:30: warning: 'fold_array' may be used uninitialized in this function [-Wmaybe-uninitialized]
regexec.c:6960:17: note: 'fold_array' was declared here
regexec.c:7062:22: warning: 'folder' may be used uninitialized in this function [-Wmaybe-uninitialized]
regexec.c:6959:16: note: 'folder' was declared here
Piece.xs: In function '_strptime':
Piece.xs:719:8: warning: 'len' may be used uninitialized in this function [-Wmaybe-uninitialized]
re_exec.c:4401:21: warning: format '%u' expects argument of type 'unsigned int', but argument 13 has type 'U32 {aka const long unsigned int}' [-Wformat=]
regexec.c:4401:21: warning: format '%u' expects argument of type 'unsigned int', but argument 13 has type 'U32 {aka const long unsigned int}' [-Wformat=]

Non-Fatal messages(gcc):



-- 
Report by Test::Smoke v1.71 running on perl 5.26.1
(Reporter v0.053 / Smoker v0.046)

Thread Next


nntp.perl.org: Perl Programming lists via nntp and http.
Comments to Ask Bjørn Hansen at ask@perl.org | Group listing | About