develooper Front page | perl.daily-build.reports | Postings from February 2021

Smoke [blead] v5.33.6-137-gc2daba311f FAIL(F) dragonfly 5.8-RELEASE(x86_64/1 cpu)

From:
Carlos Guevara
Date:
February 20, 2021 22:59
Subject:
Smoke [blead] v5.33.6-137-gc2daba311f FAIL(F) dragonfly 5.8-RELEASE(x86_64/1 cpu)
Message ID:
60319462.90b.7e14ad65@cjg-dragonfly5
Automated smoke report for branch blead 5.33.8 patch c2daba311fa72a806caf9e6aea0531115d174412 v5.33.6-137-gc2daba311f
cjg-dragonfly5: Intel(R) Xeon(R) CPU E5-2620 v2 @ 2.10GHz (x86_64/1 cpu)
    on        dragonfly - 5.8-RELEASE
    using     gcc version 8.3 [DragonFly] Release/2019-02-22
    smoketime 7 hours 56 minutes (average 39 minutes 45 seconds)

Summary: FAIL(F)

O = OK  F = Failure(s), extended report at the bottom
X = Failure(s) under TEST but not under harness
? = still running or test results not (yet) available
Build failures during:       - = unknown or N/A
c = Configure, m = make, M = make (after miniperl), t = make test-prep

v5.33.6-137-gc2daba311f  Configuration (common) -Dcc=gcc
----------- ---------------------------------------------------------
F F         
F F         -Duse64bitall
F F         -Duselongdouble
F F         -Duseithreads
F F         -Duseithreads -Duse64bitall
F F         -Duseithreads -Duselongdouble
| +--------- -DDEBUGGING
+----------- no debugging


Testsuite was run only with 'harness'

Tests skipped on user request:
    # One test name on a line
Failures: (common-args) -Dcc=gcc
[default] 
[default] -DDEBUGGING
[default] -Duse64bitall
[default] -DDEBUGGING -Duse64bitall
[default] -Duselongdouble
[default] -DDEBUGGING -Duselongdouble
[default] -Duseithreads
[default] -DDEBUGGING -Duseithreads
[default] -Duseithreads -Duse64bitall
[default] -DDEBUGGING -Duseithreads -Duse64bitall
[default] -Duseithreads -Duselongdouble
[default] -DDEBUGGING -Duseithreads -Duselongdouble
../t/porting/corelist.t.....................................FAILED
    3-5
../dist/Module-CoreList/t/is_core.t.........................FAILED
    2, 11
    Non-zero exit status: 2
../dist/Module-CoreList/t/maintainer.t......................FAILED
    4-5
    Non-zero exit status: 2

MANIFEST did not declare '.mailmap'

Passed Todo tests: (common-args) -Dcc=gcc
[default] 
[default] -DDEBUGGING
[default] -Duse64bitall
[default] -DDEBUGGING -Duse64bitall
[default] -Duselongdouble
[default] -DDEBUGGING -Duselongdouble
[default] -Duseithreads
[default] -DDEBUGGING -Duseithreads
[default] -Duseithreads -Duse64bitall
[default] -DDEBUGGING -Duseithreads -Duse64bitall
[default] -Duseithreads -Duselongdouble
[default] -DDEBUGGING -Duseithreads -Duselongdouble
../t/op/stat.t..............................................PASSED
    9

Compiler messages(gcc):
DB_File.xs: In function 'ParseOpenInfo':
DB_File.xs:476:44: warning: suggest braces around empty body in an 'if' statement [-Wempty-body]
DB_File.xs:1044:13: note: in expansion of macro 'croak_and_free'
DB_File.xs:1050:13: note: in expansion of macro 'croak_and_free'
DB_File.xs:1056:17: note: in expansion of macro 'croak_and_free'
DB_File.xs:1091:17: note: in expansion of macro 'croak_and_free'
DB_File.xs:1140:17: note: in expansion of macro 'croak_and_free'
DB_File.xs:1229:13: note: in expansion of macro 'croak_and_free'
Socket.c: In function 'XS_Socket_pack_ip_mreq_source':
Socket.c:1694:7: warning: variable 'interface' set but not used [-Wunused-but-set-variable]
ListUtil.c: In function 'XS_List__Util_reduce':
../../embed.h:66:23: warning: 'retvals' may be used uninitialized in this function [-Wmaybe-uninitialized]
ListUtil.xs:530:9: note: 'retvals' was declared here

Non-Fatal messages(gcc):



-- 
Report by Test::Smoke v1.71 running on perl 5.30.2
(Reporter v0.053 / Smoker v0.046)



nntp.perl.org: Perl Programming lists via nntp and http.
Comments to Ask Bjørn Hansen at ask@perl.org | Group listing | About