develooper Front page | perl.daily-build.reports | Postings from February 2021

Smoke [blead] v5.33.6-137-gc2daba311f FAIL(F) linux4.15.0-135-generic [Ubuntu 18.04.5 LTS (x86_64/1 cpu)

From:
Carlos Guevara
Date:
February 20, 2021 21:42
Subject:
Smoke [blead] v5.33.6-137-gc2daba311f FAIL(F) linux4.15.0-135-generic [Ubuntu 18.04.5 LTS (x86_64/1 cpu)
Message ID:
20210220214228.D7AD1144730@cjg-bionic
Automated smoke report for branch blead 5.33.8 patch c2daba311fa72a806caf9e6aea0531115d174412 v5.33.6-137-gc2daba311f
cjg-bionic: Intel(R) Xeon(R) CPU E5-2620 v2 @ 2.10GHz (GenuineIntel 2068MHz) (x86_64/1 cpu)
    on        linux - 4.15.0-135-generic [Ubuntu 18.04.5 LTS (bionic)]
    using     g++ version 7.5.0
    smoketime 6 hours 38 minutes (average 33 minutes 12 seconds)

Summary: FAIL(F)

O = OK  F = Failure(s), extended report at the bottom
X = Failure(s) under TEST but not under harness
? = still running or test results not (yet) available
Build failures during:       - = unknown or N/A
c = Configure, m = make, M = make (after miniperl), t = make test-prep

v5.33.6-137-gc2daba311f  Configuration (common) -Dcc=g++
----------- ---------------------------------------------------------
F F         
F F         -Duse64bitall
F F         -Dusequadmath
F F         -Duseithreads
F F         -Duseithreads -Duse64bitall
F F         -Duseithreads -Dusequadmath
| +--------- -DDEBUGGING
+----------- no debugging


Testsuite was run only with 'harness'

Tests skipped on user request:
    # One test name on a line
Failures: (common-args) -Dcc=g++
[default] 
../t/porting/corelist.t.....................................FAILED
    3-5
../dist/IO/t/io_poll.t......................................FAILED
    12
../dist/Module-CoreList/t/is_core.t.........................FAILED
    2, 11
    Non-zero exit status: 2
../dist/Module-CoreList/t/maintainer.t......................FAILED
    4-5
    Non-zero exit status: 2

[default] -DDEBUGGING
[default] -Duse64bitall
[default] -DDEBUGGING -Duse64bitall
[default] -Dusequadmath
[default] -DDEBUGGING -Dusequadmath
[default] -DDEBUGGING -Duseithreads
[default] -Duseithreads -Duse64bitall
[default] -DDEBUGGING -Duseithreads -Duse64bitall
../t/porting/corelist.t.....................................FAILED
    3-5
../dist/Module-CoreList/t/is_core.t.........................FAILED
    2, 11
    Non-zero exit status: 2
../dist/Module-CoreList/t/maintainer.t......................FAILED
    4-5
    Non-zero exit status: 2

[default] -Duseithreads
[default] -Duseithreads -Dusequadmath
../t/porting/corelist.t.....................................FAILED
    3-5
../cpan/ExtUtils-MakeMaker/t/eu_command.t...................FAILED
    8
    Non-zero exit status: 1
../dist/Module-CoreList/t/is_core.t.........................FAILED
    2, 11
    Non-zero exit status: 2
../dist/Module-CoreList/t/maintainer.t......................FAILED
    4-5
    Non-zero exit status: 2

[default] -DDEBUGGING -Duseithreads -Dusequadmath
../t/porting/corelist.t.....................................FAILED
    3-5
../dist/Module-CoreList/t/is_core.t.........................FAILED
    2, 11
    Non-zero exit status: 2
../dist/Module-CoreList/t/maintainer.t......................FAILED
    4-5
    Non-zero exit status: 2
../dist/Time-HiRes/t/usleep.t...............................FAILED
    4
    Non-zero exit status: 1

MANIFEST did not declare '.mailmap'

Compiler messages(gcc):
inflate.c: In function 'int inflate(z_streamp, int)':
inflate.c:724:25: warning: this statement may fall through [-Wimplicit-fallthrough=]
inflate.c:725:9: note: here
inflate.c:732:25: warning: this statement may fall through [-Wimplicit-fallthrough=]
inflate.c:733:9: note: here
inflate.c:947:25: warning: this statement may fall through [-Wimplicit-fallthrough=]
inflate.c:948:9: note: here
inflate.c:968:25: warning: this statement may fall through [-Wimplicit-fallthrough=]
inflate.c:969:9: note: here
Socket.xs: In function 'void XS_Socket_inet_aton(CV*)':
Socket.xs:769:28: warning: missing initializer for member 'addrinfo::ai_family' [-Wmissing-field-initializers]
Socket.xs:769:28: warning: missing initializer for member 'addrinfo::ai_socktype' [-Wmissing-field-initializers]
Socket.xs:769:28: warning: missing initializer for member 'addrinfo::ai_protocol' [-Wmissing-field-initializers]
Socket.xs:769:28: warning: missing initializer for member 'addrinfo::ai_addrlen' [-Wmissing-field-initializers]
Socket.xs:769:28: warning: missing initializer for member 'addrinfo::ai_addr' [-Wmissing-field-initializers]
Socket.xs:769:28: warning: missing initializer for member 'addrinfo::ai_canonname' [-Wmissing-field-initializers]
Socket.xs:769:28: warning: missing initializer for member 'addrinfo::ai_next' [-Wmissing-field-initializers]
HiRes.xs: In function 'void XS_Time__HiRes_setitimer(CV*)':
HiRes.xs:1248:42: warning: option '-Wc++-compat' is valid for C/ObjC but not for C++ [-Wpragmas]
HiRes.xs: In function 'void XS_Time__HiRes_getitimer(CV*)':
HiRes.xs:1268:42: warning: option '-Wc++-compat' is valid for C/ObjC but not for C++ [-Wpragmas]
../../embed.h: In function 'void XS_List__Util_reduce(CV*)':
../../embed.h:66:35: warning: 'retvals' may be used uninitialized in this function [-Wmaybe-uninitialized]
ListUtil.xs:530:9: note: 'retvals' was declared here
Socket.xs: In function 'void XS_Socket_inet_aton(PerlInterpreter*, CV*)':
HiRes.xs: In function 'void XS_Time__HiRes_setitimer(PerlInterpreter*, CV*)':
HiRes.xs: In function 'void XS_Time__HiRes_getitimer(PerlInterpreter*, CV*)':
../../embed.h: In function 'void XS_List__Util_reduce(PerlInterpreter*, CV*)':

Non-Fatal messages(gcc):



-- 
Report by Test::Smoke v1.71 running on perl 5.26.1
(Reporter v0.053 / Smoker v0.046)



nntp.perl.org: Perl Programming lists via nntp and http.
Comments to Ask Bjørn Hansen at ask@perl.org | Group listing | About