develooper Front page | perl.daily-build.reports | Postings from August 2020

Smoke [smoke-me/khw-env] v5.33.0-186-g05da0cb29c PASS netbsd 9.0(amd64/1 cpu)

From:
Carlos Guevara
Date:
August 2, 2020 11:26
Subject:
Smoke [smoke-me/khw-env] v5.33.0-186-g05da0cb29c PASS netbsd 9.0(amd64/1 cpu)
Message ID:
20200802112430.67BC137C97E@cjg-netbsd9
Automated smoke report for branch smoke-me/khw-env 5.33.1 patch 05da0cb29c08f10c5ce4d828dca6a72c019cfbaa v5.33.0-186-g05da0cb29c
cjg-netbsd9: Intel 686-class (amd64/1 cpu)
    on        netbsd - 9.0
    using     g++ version 7.4.0
    smoketime 5 hours 32 minutes (average 41 minutes 34 seconds)

Summary: PASS

O = OK  F = Failure(s), extended report at the bottom
X = Failure(s) under TEST but not under harness
? = still running or test results not (yet) available
Build failures during:       - = unknown or N/A
c = Configure, m = make, M = make (after miniperl), t = make test-prep

v5.33.0-186-g05da0cb29c  Configuration (common) -Dcc=g++
----------- ---------------------------------------------------------
O O         
O O         -Duse64bitall
O O         -Duseithreads
O O         -Duseithreads -Duse64bitall
| +--------- -DDEBUGGING
+----------- no debugging


Locally applied patches:
    SMOKE05da0cb29c08f10c5ce4d828dca6a72c019cfbaa

Testsuite was run only with 'harness'

Tests skipped on user request:
    # One test name on a line
MANIFEST did not declare '.mailmap'

Compiler messages(gcc):
/usr/include/sys/cdefs_elf.h:67:20: error: missing binary operator before token "("
/usr/include/sys/cdefs_elf.h:73:20: error: missing binary operator before token "("
/usr/include/sys/cdefs_elf.h:79:20: error: missing binary operator before token "("
inflate.c: In function 'int inflate(z_streamp, int)':
inflate.c:724:25: warning: this statement may fall through [-Wimplicit-fallthrough=]
inflate.c:725:9: note: here
inflate.c:732:25: warning: this statement may fall through [-Wimplicit-fallthrough=]
inflate.c:733:9: note: here
inflate.c:947:25: warning: this statement may fall through [-Wimplicit-fallthrough=]
inflate.c:948:9: note: here
inflate.c:968:25: warning: this statement may fall through [-Wimplicit-fallthrough=]
inflate.c:969:9: note: here
DB_File.xs: In function 'DB_File_type* ParseOpenInfo(int, char*, int, int, SV*)':
DB_File.xs:476:44: warning: suggest braces around empty body in an 'if' statement [-Wempty-body]
DB_File.xs:1044:13: note: in expansion of macro 'croak_and_free'
DB_File.xs:1050:13: note: in expansion of macro 'croak_and_free'
DB_File.xs:1056:17: note: in expansion of macro 'croak_and_free'
DB_File.xs:1091:17: note: in expansion of macro 'croak_and_free'
DB_File.xs:1140:17: note: in expansion of macro 'croak_and_free'
DB_File.xs:1229:13: note: in expansion of macro 'croak_and_free'
SysV.xs: In function 'void XS_IPC__SysV_memwrite(CV*)':
SysV.xs:382:24: warning: comparison between signed and unsigned integer expressions [-Wsign-compare]
SysV.xs:384:11: warning: comparison between signed and unsigned integer expressions [-Wsign-compare]
Socket.c: In function 'void XS_Socket_pack_ip_mreq_source(CV*)':
Socket.c:1673:7: warning: variable 'interface' set but not used [-Wunused-but-set-variable]
const-c.inc: In function 'int constant_19(const char*, IV*)':
const-c.inc:351:42: warning: unused parameter 'iv_return' [-Wunused-parameter]
HiRes.xs: In function 'void XS_Time__HiRes_setitimer(CV*)':
HiRes.xs:1251:42: warning: option '-Wc++-compat' is valid for C/ObjC but not for C++ [-Wpragmas]
HiRes.xs: In function 'void XS_Time__HiRes_getitimer(CV*)':
HiRes.xs:1271:42: warning: option '-Wc++-compat' is valid for C/ObjC but not for C++ [-Wpragmas]
Piece.xs: In function 'char* _strptime(const char*, const char*, tm*, int*)':
Piece.xs:719:8: warning: 'len' may be used uninitialized in this function [-Wmaybe-uninitialized]
re_exec.c: In function 'bool S_regtry(regmatch_info*, char**)':
re_exec.c:6529:38: warning: 'fold_array' may be used uninitialized in this function [-Wmaybe-uninitialized]
re_exec.c:6433:17: note: 'fold_array' was declared here
re_exec.c:6535:28: warning: 'folder' may be used uninitialized in this function [-Wmaybe-uninitialized]
re_exec.c:6432:16: note: 'folder' was declared here
regexec.c: In function 'bool S_regtry(regmatch_info*, char**)':
regexec.c:6529:38: warning: 'fold_array' may be used uninitialized in this function [-Wmaybe-uninitialized]
regexec.c:6433:17: note: 'fold_array' was declared here
regexec.c:6535:28: warning: 'folder' may be used uninitialized in this function [-Wmaybe-uninitialized]
regexec.c:6432:16: note: 'folder' was declared here
time64.c: In function 'TM64* Perl_localtime64_r(const Time64_T*, TM64*)':
time64.c:573:30: warning: 'orig_year' may be used uninitialized in this function [-Wmaybe-uninitialized]
DB_File.xs: In function 'DB_File_type* ParseOpenInfo(PerlInterpreter*, int, char*, int, int, SV*)':
SysV.xs: In function 'void XS_IPC__SysV_memwrite(PerlInterpreter*, CV*)':
Socket.c: In function 'void XS_Socket_pack_ip_mreq_source(PerlInterpreter*, CV*)':
const-c.inc: In function 'int constant_19(PerlInterpreter*, const char*, IV*)':
HiRes.xs: In function 'void XS_Time__HiRes_setitimer(PerlInterpreter*, CV*)':
HiRes.xs: In function 'void XS_Time__HiRes_getitimer(PerlInterpreter*, CV*)':
Piece.xs: In function 'char* _strptime(PerlInterpreter*, const char*, const char*, tm*, int*)':
re_exec.c: In function 'bool S_regtry(PerlInterpreter*, regmatch_info*, char**)':
regexec.c: In function 'bool S_regtry(PerlInterpreter*, regmatch_info*, char**)':

Non-Fatal messages(gcc):



-- 
Report by Test::Smoke v1.71 running on perl 5.26.1
(Reporter v0.053 / Smoker v0.046)



nntp.perl.org: Perl Programming lists via nntp and http.
Comments to Ask Bjørn Hansen at ask@perl.org | Group listing | About