develooper Front page | perl.daily-build.reports | Postings from August 2020

Smoke [smoke-me/khw-version] v5.33.0-102-g021317862c FAIL(F)dragonfly 5.8-RELEASE (x86_64/1 cpu)

From:
Carlos Guevara
Date:
August 2, 2020 09:31
Subject:
Smoke [smoke-me/khw-version] v5.33.0-102-g021317862c FAIL(F)dragonfly 5.8-RELEASE (x86_64/1 cpu)
Message ID:
5f2687f5.3b7aa63.40dd4e08@cjg-dragonfly5
Automated smoke report for branch smoke-me/khw-version 5.33.1 patch 021317862c846d4ecc80641c9118717ca4654614 v5.33.0-102-g021317862c
cjg-dragonfly5: Intel(R) Xeon(R) CPU E5-2620 v2 @ 2.10GHz (x86_64/1 cpu)
    on        dragonfly - 5.8-RELEASE
    using     gcc version 8.3 [DragonFly] Release/2019-02-22
    smoketime 8 hours 25 minutes (average 42 minutes 6 seconds)

Summary: FAIL(F)

O = OK  F = Failure(s), extended report at the bottom
X = Failure(s) under TEST but not under harness
? = still running or test results not (yet) available
Build failures during:       - = unknown or N/A
c = Configure, m = make, M = make (after miniperl), t = make test-prep

v5.33.0-102-g021317862c  Configuration (common) -Dcc=gcc
----------- ---------------------------------------------------------
F F         
F F         -Duse64bitall
F F         -Duselongdouble
F F         -Duseithreads
F F         -Duseithreads -Duse64bitall
F F         -Duseithreads -Duselongdouble
| +--------- -DDEBUGGING
+----------- no debugging


Locally applied patches:
    SMOKE021317862c846d4ecc80641c9118717ca4654614

Testsuite was run only with 'harness'

Tests skipped on user request:
    # One test name on a line
Failures: (common-args) -Dcc=gcc
[default] 
[default] -DDEBUGGING
[default] -Duse64bitall
[default] -DDEBUGGING -Duse64bitall
[default] -Duselongdouble
[default] -DDEBUGGING -Duselongdouble
[default] -Duseithreads
[default] -DDEBUGGING -Duseithreads
[default] -Duseithreads -Duse64bitall
[default] -DDEBUGGING -Duseithreads -Duse64bitall
[default] -Duseithreads -Duselongdouble
[default] -DDEBUGGING -Duseithreads -Duselongdouble
../t/io/fs.t................................................FAILED
    30-31, 36-37
../dist/Time-HiRes/t/utime.t................................FAILED
    2-3, 5-6, 12-15
    Non-zero exit status: 8
../ext/POSIX/t/termios.t....................................FAILED
    74, 76, 1589, 1591, 1593, 1595
    Non-zero exit status: 6

MANIFEST did not declare '.mailmap'

Compiler messages(gcc):
sv.c: In function 'Perl_sv_vcatpvfn_flags':
config.h:909:39: warning: '%.*g' directive writing between 1 and 133 bytes into a region of size 127 [-Wformat-overflow=]
perl.h:6623:13: note: in definition of macro 'WITH_LC_NUMERIC_SET_TO_NEEDED_IN'
sv.c:48:5: note: in expansion of macro 'PERL_UNUSED_RESULT'
sv.c:48:24: note: in expansion of macro 'Gconvert'
sv.c:13110:21: note: in expansion of macro 'SNPRINTF_G'
config.h:909:39: note: assuming directive output of 132 bytes
config.h:909:27: note: 'sprintf' output between 2 and 134 bytes into a destination of size 127
scope.c: In function 'Perl_leave_scope':
scope.c:1369:33: warning: 'was_hinthv' may be used uninitialized in this function [-Wmaybe-uninitialized]
DB_File.xs: In function 'ParseOpenInfo':
DB_File.xs:476:44: warning: suggest braces around empty body in an 'if' statement [-Wempty-body]
DB_File.xs:1044:13: note: in expansion of macro 'croak_and_free'
DB_File.xs:1050:13: note: in expansion of macro 'croak_and_free'
DB_File.xs:1056:17: note: in expansion of macro 'croak_and_free'
DB_File.xs:1091:17: note: in expansion of macro 'croak_and_free'
DB_File.xs:1140:17: note: in expansion of macro 'croak_and_free'
DB_File.xs:1229:13: note: in expansion of macro 'croak_and_free'
SysV.xs: In function 'XS_IPC__SysV_memwrite':
SysV.xs:382:24: warning: comparison of integer expressions of different signedness: 'int' and 'UV' {aka 'long unsigned int'} [-Wsign-compare]
SysV.xs:382:41: warning: operand of ?: changes signedness from 'int' to 'UV' {aka 'long unsigned int'} due to unsignedness of other operand [-Wsign-compare]
SysV.xs:384:11: warning: comparison of integer expressions of different signedness: 'int' and 'UV' {aka 'long unsigned int'} [-Wsign-compare]
Socket.c: In function 'XS_Socket_pack_ip_mreq_source':
Socket.c:1673:7: warning: variable 'interface' set but not used [-Wunused-but-set-variable]
APItest.c: In function 'XS_XS__APItest__Magic_test_Gconvert':
../../config.h:909:39: warning: '%.*g' directive writing between 1 and 106 bytes into a region of size 100 [-Wformat-overflow=]
../../perl.h:438:67: note: in definition of macro 'PERL_UNUSED_RESULT'
APItest.xs:6801:28: note: in expansion of macro 'Gconvert'
../../config.h:909:39: note: assuming directive output of 105 bytes
../../config.h:909:27: note: 'sprintf' output between 2 and 107 bytes into a destination of size 100
config.h:909:39: warning: '%.*Lg' directive writing between 1 and 137 bytes into a region of size 130 [-Wformat-overflow=]
config.h:909:40: note: format string is defined here
config.h:909:39: note: assuming directive output of 136 bytes
config.h:909:27: note: 'sprintf' output between 2 and 138 bytes into a destination of size 130
../../config.h:909:39: warning: '%.*Lg' directive writing between 1 and 107 bytes into a region of size 100 [-Wformat-overflow=]
../../config.h:909:39: note: assuming directive output of 106 bytes
../../config.h:909:27: note: 'sprintf' output between 2 and 108 bytes into a destination of size 100
time64.c: In function 'Perl_localtime64_r':
time64.c:573:30: warning: 'orig_year' may be used uninitialized in this function [-Wmaybe-uninitialized]
Opcode.xs: In function 'opmask_addlocal':
Opcode.xs:240:17: warning: cast between incompatible function types from 'void (*)(PerlInterpreter *, const char *, ...)' {aka 'void (*)(struct interpreter *, const char *, ...)'} to 'void (*)(void *)' [-Wcast-function-type]
../../embed.h:496:57: note: in definition of macro 'save_destructor'
Opcode.xs:240:2: note: in expansion of macro 'SAVEDESTRUCTOR'
ListUtil.c: In function 'XS_List__Util_reduce':
../../embed.h:59:23: warning: 'retvals' may be used uninitialized in this function [-Wmaybe-uninitialized]
ListUtil.xs:530:9: note: 'retvals' was declared here

Non-Fatal messages(gcc):



-- 
Report by Test::Smoke v1.71 running on perl 5.26.1
(Reporter v0.053 / Smoker v0.046)



nntp.perl.org: Perl Programming lists via nntp and http.
Comments to Ask Bjørn Hansen at ask@perl.org | Group listing | About