develooper Front page | perl.daily-build.reports | Postings from August 2020

Smoke [blead] v5.33.0-193-g36302d6a4c FAIL(F) MSWin32 Win10 Business(Intel64/8 cpu) {mswin32-win10-smoke-me}

From:
George Greer
Date:
August 2, 2020 00:32
Subject:
Smoke [blead] v5.33.0-193-g36302d6a4c FAIL(F) MSWin32 Win10 Business(Intel64/8 cpu) {mswin32-win10-smoke-me}
Message ID:
202008020032.0720WALu2072589@vier.local
[smoke setup in testing; ignore for now] Smoke logs available at http://m-lorg/~perl/smoke/perl/mswin32-x64-multi-thread-win10/mswin32-win10-smoke-me/Karl%20Williamson/log36302d6a4c1fe299880acf04194eeeb2a82d6305.log.gz

Automated smoke report for branch smoke-me/khw-pr 5.33.1 patch 36302d6a4c1fe299880acf04194eeeb2a82d6305 v5.33.0-193-g36302d6a4c
Dell-Latitude-E6530: Intel(R) Core(TM) i7-3740QM CPU @ 2.70GHz(~2691 MHz) (Intel64/8 cpu)
    on        MSWin32 - Win10 Business
    using     cl version 19.24.28316
    smoketime 6 hours 24 minutes (average 48 minutes 5 seconds)

Summary: FAIL(F)

O = OK  F = Failure(s), extended report at the bottom
X = Failure(s) under TEST but not under harness
? = still running or test results not (yet) available
Build failures during:       - = unknown or N/A
c = Configure, m = make, M = make (after miniperl), t = make test-prep

v5.33.0-193-g36302d6a4c  Configuration (common) none
----------- ---------------------------------------------------------
F F         
F F         -Duselargefiles
F F         -Duseithreads
F F         -Duseithreads -Duselargefiles
| +--------- -DDEBUGGING
+----------- no debugging


Locally applied patches:
    SMOKE36302d6a4c1fe299880acf04194eeeb2a82d6305

Failures: (common-args) none
[default] 
../cpan/ExtUtils-MakeMaker/t/02-xsdynamic.t.................FAILED
    17, 22, 35, 40
    Non-zero exit status: 4
../cpan/ExtUtils-PL2Bat/t/make_executable.t.................FAILED
    2, 4, 6
    Non-zero exit status: 3

[default] -DDEBUGGING
[default] -Duselargefiles
[default] -DDEBUGGING -Duselargefiles
../cpan/ExtUtils-MakeMaker/t/02-xsdynamic.t.................FAILED
    17, 22, 35, 40
    Non-zero exit status: 4
../cpan/ExtUtils-PL2Bat/t/make_executable.t.................FAILED
    2, 4, 6
    Non-zero exit status: 3
../dist/Net-Ping/t/450_service.t............................FAILED
    9
    Non-zero exit status: 1

[default] -Duseithreads
[default] -DDEBUGGING -Duseithreads
[default] -Duseithreads -Duselargefiles
[default] -DDEBUGGING -Duseithreads -Duselargefiles
../cpan/ExtUtils-PL2Bat/t/make_executable.t.................FAILED
    2, 4, 6
    Non-zero exit status: 3
../dist/Net-Ping/t/450_service.t............................FAILED
    9
    Non-zero exit status: 1

MANIFEST did not declare '.MAILMAP'

Passed Todo tests: (common-args) none
[default] 
[default] -DDEBUGGING
[default] -Duselargefiles
[default] -DDEBUGGING -Duselargefiles
[default] -Duseithreads
[default] -DDEBUGGING -Duseithreads
[default] -Duseithreads -Duselargefiles
[default] -DDEBUGGING -Duseithreads -Duselargefiles
../ext/IPC-Open3/t/IPC-Open3.t..............................PASSED
    25

Compiler messages(MSWin32):
[2020-08-01 18:10:44Z] perlio.obj : warning LNK4197: export 'PerlIO_pending' specified multiple times; using first specification
[2020-08-01 18:10:44Z] perlio.obj : warning LNK4197: export 'PerlIO_perlio' specified multiple times; using first specification
# Test.obj : error LNK2001: unresolved external symbol PL_curpad
# Test.obj : error LNK2001: unresolved external symbol PL_op
# Test.obj : error LNK2001: unresolved external symbol PL_stack_base
# Test.obj : error LNK2001: unresolved external symbol PL_tainted
# Test.obj : error LNK2001: unresolved external symbol PL_markstack_ptr
# Test.obj : error LNK2001: unresolved external symbol PL_stack_sp
# blib\arch\auto\XS\Test\Test.dll : fatal error LNK1120: 6 unresolved externals
# NMAKE : fatal error U1077: '"C:\Program Files (x86)\Microsoft Visual Studio\2019\Community\VC\Tools\MSVC\14.24.28314\bin\HostX64\x64\link.EXE"' : return code '0x460'
# Other.obj : error LNK2001: unresolved external symbol PL_curpad
# Other.obj : error LNK2001: unresolved external symbol PL_op
# Other.obj : error LNK2001: unresolved external symbol PL_stack_base
# Other.obj : error LNK2001: unresolved external symbol PL_tainted
# Other.obj : error LNK2001: unresolved external symbol PL_markstack_ptr
# Other.obj : error LNK2001: unresolved external symbol PL_stack_sp
# blib\arch\auto\XS\Other\Other.dll : fatal error LNK1120: 6 unresolved externals
[2020-08-01 18:44:22Z] perlio.obj : warning LNK4197: export 'PerlIO_perlio' specified multiple times; using first specification
[2020-08-01 18:44:22Z] perlio.obj : warning LNK4197: export 'PerlIO_pending' specified multiple times; using first specification
[2020-08-01 18:44:22Z] c:\perl\smoke\perl\mswin32-win10-smoke-me\build\ext\POSIX\POSIX.xs(1106) : warning C4715: 'my_rint': not all control paths return a value
# Test.obj : error LNK2001: unresolved external symbol PL_markstack
# Test.obj : error LNK2001: unresolved external symbol PL_debug
# blib\arch\auto\XS\Test\Test.dll : fatal error LNK1120: 7 unresolved externals
# Other.obj : error LNK2001: unresolved external symbol PL_markstack
# Other.obj : error LNK2001: unresolved external symbol PL_debug
# blib\arch\auto\XS\Other\Other.dll : fatal error LNK1120: 7 unresolved externals
[2020-08-01 19:36:33Z] perlio.obj : warning LNK4197: export 'PerlIO_pending' specified multiple times; using first specification
[2020-08-01 19:36:33Z] perlio.obj : warning LNK4197: export 'PerlIO_perlio' specified multiple times; using first specification
[2020-08-01 20:09:57Z] perlio.obj : warning LNK4197: export 'PerlIO_perlio' specified multiple times; using first specification
[2020-08-01 20:09:57Z] perlio.obj : warning LNK4197: export 'PerlIO_pending' specified multiple times; using first specification
[2020-08-01 20:09:57Z] c:\perl\smoke\perl\mswin32-win10-smoke-me\build\ext\POSIX\POSIX.xs(1106) : warning C4715: 'my_rint': not all control paths return a value
[2020-08-01 21:02:31Z] perlio.obj : warning LNK4197: export 'PerlIO_pending' specified multiple times; using first specification
[2020-08-01 21:02:31Z] perlio.obj : warning LNK4197: export 'PerlIO_perlio' specified multiple times; using first specification
[2020-08-01 21:42:24Z] perlio.obj : warning LNK4197: export 'PerlIO_perlio' specified multiple times; using first specification
[2020-08-01 21:42:24Z] perlio.obj : warning LNK4197: export 'PerlIO_pending' specified multiple times; using first specification
[2020-08-01 21:42:24Z] c:\perl\smoke\perl\mswin32-win10-smoke-me\build\ext\POSIX\POSIX.xs(1106) : warning C4715: 'my_rint': not all control paths return a value
[2020-08-01 22:48:56Z] perlio.obj : warning LNK4197: export 'PerlIO_pending' specified multiple times; using first specification
[2020-08-01 22:48:56Z] perlio.obj : warning LNK4197: export 'PerlIO_perlio' specified multiple times; using first specification
[2020-08-01 23:28:50Z] perlio.obj : warning LNK4197: export 'PerlIO_perlio' specified multiple times; using first specification
[2020-08-01 23:28:50Z] perlio.obj : warning LNK4197: export 'PerlIO_pending' specified multiple times; using first specification
[2020-08-01 23:28:50Z] c:\perl\smoke\perl\mswin32-win10-smoke-me\build\ext\POSIX\POSIX.xs(1106) : warning C4715: 'my_rint': not all control paths return a value

Non-Fatal messages(MSWin32):

-- 
Report by Test::Smoke v1.72 running on perl 5.28.1
(Reporter v0.053 / Smoker v0.046)



nntp.perl.org: Perl Programming lists via nntp and http.
Comments to Ask Bjørn Hansen at ask@perl.org | Group listing | About