develooper Front page | perl.daily-build.reports | Postings from August 2020

Smoke [blead] v5.33.0-187-gf8d68e7931 FAIL(F) MSWin32 Win10 Business(Intel64/8 cpu) {mswin32-win10-blead}

From:
George Greer
Date:
August 1, 2020 06:02
Subject:
Smoke [blead] v5.33.0-187-gf8d68e7931 FAIL(F) MSWin32 Win10 Business(Intel64/8 cpu) {mswin32-win10-blead}
Message ID:
202008010602.07162Zi61991522@vier.local
[smoke setup in testing; ignore for now] Smoke logs available at http://m-lorg/~perl/smoke/perl/mswin32-x64-multi-thread-win10/mswin32-win10-blead/logf8d68e7931727fedace3c717fcd52becd73c19b2.log.gz

Automated smoke report for branch blead 5.33.1 patch f8d68e7931727fedace3c717fcd52becd73c19b2 v5.33.0-187-gf8d68e7931
Dell-Latitude-E6530: Intel(R) Core(TM) i7-3740QM CPU @ 2.70GHz(~2691 MHz) (Intel64/8 cpu)
    on        MSWin32 - Win10 Business
    using     cl version 19.24.28316
    smoketime 6 hours 21 minutes (average 47 minutes 40 seconds)

Summary: FAIL(F)

O = OK  F = Failure(s), extended report at the bottom
X = Failure(s) under TEST but not under harness
? = still running or test results not (yet) available
Build failures during:       - = unknown or N/A
c = Configure, m = make, M = make (after miniperl), t = make test-prep

v5.33.0-187-gf8d68e7931  Configuration (common) none
----------- ---------------------------------------------------------
F F         
F F         -Duselargefiles
F F         -Duseithreads
F F         -Duseithreads -Duselargefiles
| +--------- -DDEBUGGING
+----------- no debugging


Locally applied patches:
    SMOKEf8d68e7931727fedace3c717fcd52becd73c19b2

Failures: (common-args) none
[default] 
[default] -DDEBUGGING
[default] -Duselargefiles
[default] -DDEBUGGING -Duselargefiles
../cpan/ExtUtils-MakeMaker/t/02-xsdynamic.t.................FAILED
    17, 22, 35, 40
    Non-zero exit status: 4
../cpan/ExtUtils-PL2Bat/t/make_executable.t.................FAILED
    2, 4, 6
    Non-zero exit status: 3
../dist/Net-Ping/t/450_service.t............................FAILED
    9
    Non-zero exit status: 1

[default] -Duseithreads
[default] -DDEBUGGING -Duseithreads
[default] -Duseithreads -Duselargefiles
[default] -DDEBUGGING -Duseithreads -Duselargefiles
../cpan/ExtUtils-PL2Bat/t/make_executable.t.................FAILED
    2, 4, 6
    Non-zero exit status: 3
../dist/Net-Ping/t/450_service.t............................FAILED
    9
    Non-zero exit status: 1

MANIFEST did not declare '.MAILMAP'

Passed Todo tests: (common-args) none
[default] 
[default] -DDEBUGGING
[default] -Duselargefiles
[default] -DDEBUGGING -Duselargefiles
[default] -Duseithreads
[default] -DDEBUGGING -Duseithreads
[default] -Duseithreads -Duselargefiles
[default] -DDEBUGGING -Duseithreads -Duselargefiles
../ext/IPC-Open3/t/IPC-Open3.t..............................PASSED
    25

Compiler messages(MSWin32):
[2020-07-31 23:44:29Z] perlio.obj : warning LNK4197: export 'PerlIO_pending' specified multiple times; using first specification
[2020-07-31 23:44:29Z] perlio.obj : warning LNK4197: export 'PerlIO_perlio' specified multiple times; using first specification
# Test.obj : error LNK2001: unresolved external symbol PL_curpad
# Test.obj : error LNK2001: unresolved external symbol PL_op
# Test.obj : error LNK2001: unresolved external symbol PL_stack_base
# Test.obj : error LNK2001: unresolved external symbol PL_tainted
# Test.obj : error LNK2001: unresolved external symbol PL_markstack_ptr
# Test.obj : error LNK2001: unresolved external symbol PL_stack_sp
# blib\arch\auto\XS\Test\Test.dll : fatal error LNK1120: 6 unresolved externals
# NMAKE : fatal error U1077: '"C:\Program Files (x86)\Microsoft Visual Studio\2019\Community\VC\Tools\MSVC\14.24.28314\bin\HostX64\x64\link.EXE"' : return code '0x460'
# Other.obj : error LNK2001: unresolved external symbol PL_curpad
# Other.obj : error LNK2001: unresolved external symbol PL_op
# Other.obj : error LNK2001: unresolved external symbol PL_stack_base
# Other.obj : error LNK2001: unresolved external symbol PL_tainted
# Other.obj : error LNK2001: unresolved external symbol PL_markstack_ptr
# Other.obj : error LNK2001: unresolved external symbol PL_stack_sp
# blib\arch\auto\XS\Other\Other.dll : fatal error LNK1120: 6 unresolved externals
[2020-08-01 00:18:00Z] perlio.obj : warning LNK4197: export 'PerlIO_perlio' specified multiple times; using first specification
[2020-08-01 00:18:00Z] perlio.obj : warning LNK4197: export 'PerlIO_pending' specified multiple times; using first specification
[2020-08-01 00:18:00Z] c:\perl\smoke\perl\mswin32-win10-blead\build\ext\POSIX\POSIX.xs(1106) : warning C4715: 'my_rint': not all control paths return a value
# Test.obj : error LNK2001: unresolved external symbol PL_markstack
# Test.obj : error LNK2001: unresolved external symbol PL_debug
# blib\arch\auto\XS\Test\Test.dll : fatal error LNK1120: 7 unresolved externals
# Other.obj : error LNK2001: unresolved external symbol PL_markstack
# Other.obj : error LNK2001: unresolved external symbol PL_debug
# blib\arch\auto\XS\Other\Other.dll : fatal error LNK1120: 7 unresolved externals
[2020-08-01 01:10:24Z] perlio.obj : warning LNK4197: export 'PerlIO_pending' specified multiple times; using first specification
[2020-08-01 01:10:24Z] perlio.obj : warning LNK4197: export 'PerlIO_perlio' specified multiple times; using first specification
[2020-08-01 01:43:29Z] perlio.obj : warning LNK4197: export 'PerlIO_perlio' specified multiple times; using first specification
[2020-08-01 01:43:29Z] perlio.obj : warning LNK4197: export 'PerlIO_pending' specified multiple times; using first specification
[2020-08-01 01:43:29Z] c:\perl\smoke\perl\mswin32-win10-blead\build\ext\POSIX\POSIX.xs(1106) : warning C4715: 'my_rint': not all control paths return a value
[2020-08-01 02:35:36Z] perlio.obj : warning LNK4197: export 'PerlIO_pending' specified multiple times; using first specification
[2020-08-01 02:35:36Z] perlio.obj : warning LNK4197: export 'PerlIO_perlio' specified multiple times; using first specification
[2020-08-01 03:15:22Z] perlio.obj : warning LNK4197: export 'PerlIO_perlio' specified multiple times; using first specification
[2020-08-01 03:15:22Z] perlio.obj : warning LNK4197: export 'PerlIO_pending' specified multiple times; using first specification
[2020-08-01 03:15:22Z] c:\perl\smoke\perl\mswin32-win10-blead\build\ext\POSIX\POSIX.xs(1106) : warning C4715: 'my_rint': not all control paths return a value
[2020-08-01 04:22:00Z] perlio.obj : warning LNK4197: export 'PerlIO_pending' specified multiple times; using first specification
[2020-08-01 04:22:00Z] perlio.obj : warning LNK4197: export 'PerlIO_perlio' specified multiple times; using first specification
[2020-08-01 05:01:38Z] perlio.obj : warning LNK4197: export 'PerlIO_perlio' specified multiple times; using first specification
[2020-08-01 05:01:38Z] perlio.obj : warning LNK4197: export 'PerlIO_pending' specified multiple times; using first specification
[2020-08-01 05:01:38Z] c:\perl\smoke\perl\mswin32-win10-blead\build\ext\POSIX\POSIX.xs(1106) : warning C4715: 'my_rint': not all control paths return a value

Non-Fatal messages(MSWin32):

-- 
Report by Test::Smoke v1.72 running on perl 5.28.1
(Reporter v0.053 / Smoker v0.046)



nntp.perl.org: Perl Programming lists via nntp and http.
Comments to Ask Bjørn Hansen at ask@perl.org | Group listing | About