develooper Front page | perl.daily-build.reports | Postings from January 2020

Smoke [smoke-me/khw-uv] v5.31.7-114-ge152c81940 FAIL(F) darwin -19.2.0 (Mac OS X macOS 10.15.2 (Dual-Core Intel Core i5/1 cpu[2 cores])

From:
Carlos Guevara
Date:
January 15, 2020 18:58
Subject:
Smoke [smoke-me/khw-uv] v5.31.7-114-ge152c81940 FAIL(F) darwin -19.2.0 (Mac OS X macOS 10.15.2 (Dual-Core Intel Core i5/1 cpu[2 cores])
Message ID:
20200115185828.9EFE614016B@cjg-bionic
Automated smoke report for branch smoke-me/khw-uv 5.31.8 patch e152c81940827023f167b1af96007ea240ee6bfa v5.31.7-114-ge152c81940
cjg-mac.local: Mac mini (2.6 GHz) (Dual-Core Intel Core i5/1 cpu[2 cores])
    on        darwin - 19.2.0 (Mac OS X - macOS 10.15.2 (19C57))
    using     clang++ version 4.2.1 Compatible Apple LLVM 11.0.0 (clang-1100.0.33.16)
    smoketime 4 hours 56 minutes (average 24 minutes 43 seconds)

Summary: FAIL(F)

O = OK  F = Failure(s), extended report at the bottom
X = Failure(s) under TEST but not under harness
? = still running or test results not (yet) available
Build failures during:       - = unknown or N/A
c = Configure, m = make, M = make (after miniperl), t = make test-prep

v5.31.7-114-ge152c81940  Configuration (common) -Dcc=clang++
----------- ---------------------------------------------------------
F F         
F F         -Duse64bitall
F F         -Duselongdouble
O O         -Duseithreads
O O         -Duseithreads -Duse64bitall
F O         -Duseithreads -Duselongdouble
| +--------- -DDEBUGGING
+----------- no debugging


Locally applied patches:
    SMOKEe152c81940827023f167b1af96007ea240ee6bfa

Testsuite was run only with 'harness'

Tests skipped on user request:
    # One test name on a line
Failures: (common-args) -Dcc=clang++
[default] 
[default] -DDEBUGGING
[default] -Duse64bitall
[default] -DDEBUGGING -Duse64bitall
[default] -Duselongdouble
[default] -DDEBUGGING -Duselongdouble
../cpan/ExtUtils-MakeMaker/t/02-xsdynamic.t.................FAILED
    5, 11, 17, 23, 29, 35, 41, 47, 53, 59, 65
    71
    Non-zero exit status: 12
../cpan/ExtUtils-MakeMaker/t/basic.t........................FAILED
    22-28
    Non-zero exit status: 7
../ext/POSIX/t/termios.t....................................FAILED
    No plan found in TAP output

[default] -Duseithreads -Duselongdouble
../t/io/open.t..............................................FAILED
    68

Compiler messages(gcc):
op.c:3019:5: warning: unused typedef '_static_assertion_failed_3020' [-Wunused-local-typedef]
./perl.h:3664:52: note: expanded from macro 'STATIC_ASSERT_STMT'
./perl.h:3659:39: note: expanded from macro 'STATIC_ASSERT_DECL'
./perl.h:3658:41: note: expanded from macro 'STATIC_ASSERT_1'
./perl.h:3657:7: note: expanded from macro 'STATIC_ASSERT_2'
<scratch space>:71:1: note: expanded from here
op.c:3021:5: warning: unused typedef '_static_assertion_failed_3022' [-Wunused-local-typedef]
<scratch space>:74:1: note: expanded from here
op.c:7782:13: warning: unused typedef '_static_assertion_failed_7782' [-Wunused-local-typedef]
<scratch space>:87:1: note: expanded from here
op.c:16985:21: warning: unused typedef '_static_assertion_failed_16985' [-Wunused-local-typedef]
<scratch space>:95:1: note: expanded from here
toke.c:10643:43: warning: comparison of integers of different signs: 'long' and 'size_t' (aka 'unsigned long') [-Wsign-compare]
toke.c:10678:47: warning: comparison of integers of different signs: 'long' and 'size_t' (aka 'unsigned long') [-Wsign-compare]
toke.c:10841:25: warning: comparison of integers of different signs: 'long' and 'size_t' (aka 'unsigned long') [-Wsign-compare]
toke.c:777:5: warning: unused typedef '_static_assertion_failed_778' [-Wunused-local-typedef]
<scratch space>:64:1: note: expanded from here
regcomp.c:5738:105: warning: comparison of integers of different signs: 'unsigned long' and 'long' [-Wsign-compare]
regcomp.c:15379:5: warning: unused typedef '_static_assertion_failed_15379' [-Wunused-local-typedef]
<scratch space>:276:1: note: expanded from here
regcomp.c:19792:21: warning: unused typedef '_static_assertion_failed_19792' [-Wunused-local-typedef]
<scratch space>:60:1: note: expanded from here
regcomp.c:19793:21: warning: unused typedef '_static_assertion_failed_19793' [-Wunused-local-typedef]
<scratch space>:63:1: note: expanded from here
mg.c:1511:39: warning: unused parameter 'sip' [-Wunused-parameter]
mg.c:1511:67: warning: unused parameter 'uap' [-Wunused-parameter]
mg.c:3408:27: warning: unused parameter 'uap' [-Wunused-parameter]
pp_hot.c:1188:9: warning: unused typedef '_static_assertion_failed_1188' [-Wunused-local-typedef]
<scratch space>:79:1: note: expanded from here
sv.c:1287:2: warning: unused typedef '_static_assertion_failed_1287' [-Wunused-local-typedef]
sv.c:1288:2: warning: unused typedef '_static_assertion_failed_1288' [-Wunused-local-typedef]
<scratch space>:67:1: note: expanded from here
sv.c:4248:5: warning: unused typedef '_static_assertion_failed_4248' [-Wunused-local-typedef]
<scratch space>:90:1: note: expanded from here
sv.c:4249:5: warning: unused typedef '_static_assertion_failed_4249' [-Wunused-local-typedef]
<scratch space>:93:1: note: expanded from here
sv.c:4334:3: warning: unused typedef '_static_assertion_failed_4334' [-Wunused-local-typedef]
<scratch space>:96:1: note: expanded from here
sv.c:9659:5: warning: unused typedef '_static_assertion_failed_9659' [-Wunused-local-typedef]
<scratch space>:101:1: note: expanded from here
sv.c:9698:5: warning: unused typedef '_static_assertion_failed_9698' [-Wunused-local-typedef]
<scratch space>:104:1: note: expanded from here
sv.c:9753:5: warning: unused typedef '_static_assertion_failed_9753' [-Wunused-local-typedef]
<scratch space>:107:1: note: expanded from here
pp.c:3125:5: warning: unused typedef '_static_assertion_failed_3125' [-Wunused-local-typedef]
<scratch space>:150:1: note: expanded from here
pp_sys.c:527:5: warning: unused typedef '_static_assertion_failed_527' [-Wunused-local-typedef]
<scratch space>:69:1: note: expanded from here
pp_sys.c:528:5: warning: unused typedef '_static_assertion_failed_528' [-Wunused-local-typedef]
<scratch space>:72:1: note: expanded from here
pp_sys.c:529:5: warning: unused typedef '_static_assertion_failed_529' [-Wunused-local-typedef]
<scratch space>:75:1: note: expanded from here
locale.c:1761:27: warning: array subscript is of type 'char' [-Wchar-subscripts]
locale.c:1762:27: warning: array subscript is of type 'char' [-Wchar-subscripts]
DynaLoader.c:535:1: warning: duplicate 'extern' declaration specifier [-Wduplicate-decl-specifier]
../../XSUB.h:134:29: note: expanded from macro 'XS_EXTERNAL'
B.c:3518:1: warning: duplicate 'extern' declaration specifier [-Wduplicate-decl-specifier]
B.xs:2265:2: warning: unused typedef '_static_assertion_failed_2265' [-Wunused-local-typedef]
../../perl.h:3664:52: note: expanded from macro 'STATIC_ASSERT_STMT'
../../perl.h:3659:39: note: expanded from macro 'STATIC_ASSERT_DECL'
../../perl.h:3658:41: note: expanded from macro 'STATIC_ASSERT_1'
../../perl.h:3657:7: note: expanded from macro 'STATIC_ASSERT_2'
<scratch space>:66:1: note: expanded from here
Bzip2.c:1669:1: warning: duplicate 'extern' declaration specifier [-Wduplicate-decl-specifier]
Zlib.c:3713:1: warning: duplicate 'extern' declaration specifier [-Wduplicate-decl-specifier]
deflate.c:54:12: warning: unused variable 'deflate_copyright' [-Wunused-const-variable]
inftrees.c:11:12: warning: unused variable 'inflate_copyright' [-Wunused-const-variable]
Cwd.c:1079:1: warning: duplicate 'extern' declaration specifier [-Wduplicate-decl-specifier]
DB_File.c:3067:1: warning: duplicate 'extern' declaration specifier [-Wduplicate-decl-specifier]
Dumper.c:1930:1: warning: duplicate 'extern' declaration specifier [-Wduplicate-decl-specifier]
RealPPPort.c:4932:6: warning: unused variable 'offset' [-Wunused-variable]
RealPPPort.c:5638:6: warning: unused variable 'offset' [-Wunused-variable]
RealPPPort.c:8114:1: warning: duplicate 'extern' declaration specifier [-Wduplicate-decl-specifier]
Peek.c:840:1: warning: duplicate 'extern' declaration specifier [-Wduplicate-decl-specifier]
MD5.c:1054:1: warning: duplicate 'extern' declaration specifier [-Wduplicate-decl-specifier]
SHA.c:723:1: warning: duplicate 'extern' declaration specifier [-Wduplicate-decl-specifier]
Byte.c:187:1: warning: duplicate 'extern' declaration specifier [-Wduplicate-decl-specifier]
../../../XSUB.h:134:29: note: expanded from macro 'XS_EXTERNAL'
CN.c:192:1: warning: duplicate 'extern' declaration specifier [-Wduplicate-decl-specifier]
EBCDIC.c:187:1: warning: duplicate 'extern' declaration specifier [-Wduplicate-decl-specifier]
JP.c:193:1: warning: duplicate 'extern' declaration specifier [-Wduplicate-decl-specifier]
KR.c:191:1: warning: duplicate 'extern' declaration specifier [-Wduplicate-decl-specifier]
Symbol.c:187:1: warning: duplicate 'extern' declaration specifier [-Wduplicate-decl-specifier]
TW.c:190:1: warning: duplicate 'extern' declaration specifier [-Wduplicate-decl-specifier]
Unicode.c:704:1: warning: duplicate 'extern' declaration specifier [-Wduplicate-decl-specifier]
Encode.c:1356:5: warning: unused variable 'ix' [-Wunused-variable]
../../XSUB.h:185:20: note: expanded from macro 'dXSI32'
Encode.c:1398:5: warning: unused variable 'ix' [-Wunused-variable]
Encode.c:1579:1: warning: duplicate 'extern' declaration specifier [-Wduplicate-decl-specifier]
Fcntl.c:316:1: warning: duplicate 'extern' declaration specifier [-Wduplicate-decl-specifier]
DosGlob.c:208:1: warning: duplicate 'extern' declaration specifier [-Wduplicate-decl-specifier]
Glob.c:706:1: warning: duplicate 'extern' declaration specifier [-Wduplicate-decl-specifier]
Call.c:464:1: warning: duplicate 'extern' declaration specifier [-Wduplicate-decl-specifier]
Util.c:720:1: warning: duplicate 'extern' declaration specifier [-Wduplicate-decl-specifier]
FieldHash.c:718:1: warning: duplicate 'extern' declaration specifier [-Wduplicate-decl-specifier]
Langinfo.c:313:1: warning: duplicate 'extern' declaration specifier [-Wduplicate-decl-specifier]
IO.c:991:1: warning: duplicate 'extern' declaration specifier [-Wduplicate-decl-specifier]
SysV.c:829:1: warning: duplicate 'extern' declaration specifier [-Wduplicate-decl-specifier]
SysV.xs:82:20: warning: unused variable 's_sysv_unimpl' [-Wunused-variable]
ListUtil.c:2220:1: warning: duplicate 'extern' declaration specifier [-Wduplicate-decl-specifier]
Base64.c:728:1: warning: duplicate 'extern' declaration specifier [-Wduplicate-decl-specifier]
FastCalc.c:628:1: warning: duplicate 'extern' declaration specifier [-Wduplicate-decl-specifier]
NDBM_File.c:601:1: warning: duplicate 'extern' declaration specifier [-Wduplicate-decl-specifier]
Opcode.c:867:1: warning: duplicate 'extern' declaration specifier [-Wduplicate-decl-specifier]
Opcode.xs:258:5: warning: unused typedef '_static_assertion_failed_258' [-Wunused-local-typedef]
<scratch space>:70:1: note: expanded from here
POSIX.c:5635:1: warning: duplicate 'extern' declaration specifier [-Wduplicate-decl-specifier]
POSIX.xs:1215:3: warning: unused typedef '_static_assertion_failed_1215' [-Wunused-local-typedef]
POSIX.xs:1205:5: note: expanded from macro 'NV_PAYLOAD_SIZEOF_ASSERT'
POSIX.xs:1216:3: warning: unused typedef '_static_assertion_failed_1216' [-Wunused-local-typedef]
POSIX.xs:1307:3: warning: unused typedef '_static_assertion_failed_1307' [-Wunused-local-typedef]
POSIX.xs:1308:3: warning: unused typedef '_static_assertion_failed_1308' [-Wunused-local-typedef]
<scratch space>:73:1: note: expanded from here
encoding.c:792:1: warning: duplicate 'extern' declaration specifier [-Wduplicate-decl-specifier]
mmap.c:449:1: warning: duplicate 'extern' declaration specifier [-Wduplicate-decl-specifier]
scalar.c:601:1: warning: duplicate 'extern' declaration specifier [-Wduplicate-decl-specifier]
via.c:843:1: warning: duplicate 'extern' declaration specifier [-Wduplicate-decl-specifier]
SDBM_File.c:583:1: warning: duplicate 'extern' declaration specifier [-Wduplicate-decl-specifier]
Socket.c:1848:1: warning: duplicate 'extern' declaration specifier [-Wduplicate-decl-specifier]
Storable.c:8166:1: warning: duplicate 'extern' declaration specifier [-Wduplicate-decl-specifier]
Hostname.c:243:1: warning: duplicate 'extern' declaration specifier [-Wduplicate-decl-specifier]
Syslog.c:532:1: warning: duplicate 'extern' declaration specifier [-Wduplicate-decl-specifier]
HiRes.c:2370:1: warning: duplicate 'extern' declaration specifier [-Wduplicate-decl-specifier]
Piece.c:1424:1: warning: duplicate 'extern' declaration specifier [-Wduplicate-decl-specifier]
Collate.c:1048:1: warning: duplicate 'extern' declaration specifier [-Wduplicate-decl-specifier]
Normalize.c:1289:1: warning: duplicate 'extern' declaration specifier [-Wduplicate-decl-specifier]
APItest.c:3275:2: warning: 'Perl_ptr_table_clear' is deprecated [-Wdeprecated-declarations]
../../embed.h:443:28: note: expanded from macro 'ptr_table_clear'
../../proto.h:2689:4: note: 'Perl_ptr_table_clear' has been explicitly marked deprecated here
../../perl.h:3529:60: note: expanded from macro '__attribute__deprecated__'
APItest.c:13142:1: warning: duplicate 'extern' declaration specifier [-Wduplicate-decl-specifier]
XSUB-undef-XS_VERSION.c:194:1: warning: duplicate 'extern' declaration specifier [-Wduplicate-decl-specifier]
XSUB-redefined-macros.c:216:1: warning: duplicate 'extern' declaration specifier [-Wduplicate-decl-specifier]
Typemap.c:1919:1: warning: duplicate 'extern' declaration specifier [-Wduplicate-decl-specifier]
attributes.c:465:1: warning: duplicate 'extern' declaration specifier [-Wduplicate-decl-specifier]
mro.c:928:1: warning: duplicate 'extern' declaration specifier [-Wduplicate-decl-specifier]
re_comp.c:5738:105: warning: comparison of integers of different signs: 'unsigned long' and 'long' [-Wsign-compare]
re_comp.c:15379:5: warning: unused typedef '_static_assertion_failed_15379' [-Wunused-local-typedef]
<scratch space>:2:1: note: expanded from here
re.c:304:1: warning: duplicate 'extern' declaration specifier [-Wduplicate-decl-specifier]
threads.c:2193:1: warning: duplicate 'extern' declaration specifier [-Wduplicate-decl-specifier]
shared.c:2147:1: warning: duplicate 'extern' declaration specifier [-Wduplicate-decl-specifier]
ExtTest.c:660:1: warning: duplicate 'extern' declaration specifier [-Wduplicate-decl-specifier]
../../../../XSUB.h:134:29: note: expanded from macro 'XS_EXTERNAL'
ExtTest.c:356:1: warning: duplicate 'extern' declaration specifier [-Wduplicate-decl-specifier]
ExtTest.c:442:1: warning: duplicate 'extern' declaration specifier [-Wduplicate-decl-specifier]
ExtTest.c:376:1: warning: duplicate 'extern' declaration specifier [-Wduplicate-decl-specifier]
ExtTest.c:460:1: warning: duplicate 'extern' declaration specifier [-Wduplicate-decl-specifier]
ExtTest.c:441:1: warning: duplicate 'extern' declaration specifier [-Wduplicate-decl-specifier]
ExtTest.c:417:1: warning: duplicate 'extern' declaration specifier [-Wduplicate-decl-specifier]
# Test.c:181:1: warning: duplicate 'extern' declaration specifier [-Wduplicate-decl-specifier]
# ../../../../XSUB.h:134:29: note: expanded from macro 'XS_EXTERNAL'
# lib/XS/Other.c:182:1: warning: duplicate 'extern' declaration specifier [-Wduplicate-decl-specifier]
# lib/XS/Test.c:181:1: warning: duplicate 'extern' declaration specifier [-Wduplicate-decl-specifier]
# Other.c:181:1: warning: duplicate 'extern' declaration specifier [-Wduplicate-decl-specifier]
# ../../../../../XSUB.h:134:29: note: expanded from macro 'XS_EXTERNAL'
# lib/XS/Other.c:208:1: warning: duplicate 'extern' declaration specifier [-Wduplicate-decl-specifier]
# Test.c:208:1: warning: duplicate 'extern' declaration specifier [-Wduplicate-decl-specifier]
XSTest.c:340:1: warning: duplicate 'extern' declaration specifier [-Wduplicate-decl-specifier]
/Users/core/smoke/perl-current/XSUB.h:134:29: note: expanded from macro 'XS_EXTERNAL'
XSMore.c:525:1: warning: duplicate 'extern' declaration specifier [-Wduplicate-decl-specifier]
XSUsage.c:301:1: warning: duplicate 'extern' declaration specifier [-Wduplicate-decl-specifier]
<scratch space>:8:1: note: expanded from here
<scratch space>:11:1: note: expanded from here
<scratch space>:128:1: note: expanded from here
<scratch space>:208:1: note: expanded from here
<scratch space>:22:1: note: expanded from here
<scratch space>:178:1: note: expanded from here
<scratch space>:181:1: note: expanded from here
<scratch space>:41:1: note: expanded from here
<scratch space>:44:1: note: expanded from here
<scratch space>:92:1: note: expanded from here
<scratch space>:37:1: note: expanded from here
<scratch space>:52:1: note: expanded from here
<scratch space>:20:1: note: expanded from here
<scratch space>:28:1: note: expanded from here
<scratch space>:31:1: note: expanded from here
<scratch space>:34:1: note: expanded from here
<scratch space>:25:1: note: expanded from here
<scratch space>:183:1: note: expanded from here
<scratch space>:235:1: note: expanded from here
<scratch space>:238:1: note: expanded from here
<scratch space>:241:1: note: expanded from here
<scratch space>:244:1: note: expanded from here
<scratch space>:99:1: note: expanded from here
<scratch space>:147:1: note: expanded from here
<scratch space>:109:1: note: expanded from here
<scratch space>:32:1: note: expanded from here
op.c:1650:18: warning: unused parameter 'my_perl' [-Wunused-parameter]
./perl.h:182:18: note: expanded from macro 'pTHX_'
./perl.h:169:22: note: expanded from macro 'pTHX'
op.c:3785:20: warning: unused parameter 'my_perl' [-Wunused-parameter]
op.c:9289:16: warning: unused parameter 'my_perl' [-Wunused-parameter]
op.c:15129:13: warning: unused parameter 'my_perl' [-Wunused-parameter]
op.c:18366:19: warning: unused parameter 'my_perl' [-Wunused-parameter]
<scratch space>:17:1: note: expanded from here
<scratch space>:33:1: note: expanded from here
op.c:12741:6: warning: unused typedef '_static_assertion_failed_12741' [-Wunused-local-typedef]
<scratch space>:3:1: note: expanded from here
regcomp.c:4472:22: warning: unused parameter 'my_perl' [-Wunused-parameter]
regcomp.c:10452:17: warning: unused parameter 'my_perl' [-Wunused-parameter]
<scratch space>:214:1: note: expanded from here
<scratch space>:363:1: note: expanded from here
<scratch space>:366:1: note: expanded from here
<scratch space>:18:1: note: expanded from here
sv.c:11127:17: warning: unused parameter 'my_perl' [-Wunused-parameter]
<scratch space>:6:1: note: expanded from here
<scratch space>:29:1: note: expanded from here
<scratch space>:35:1: note: expanded from here
<scratch space>:40:1: note: expanded from here
<scratch space>:43:1: note: expanded from here
<scratch space>:46:1: note: expanded from here
<scratch space>:88:1: note: expanded from here
<scratch space>:14:1: note: expanded from here
doio.c:186:26: warning: unused parameter 'my_perl' [-Wunused-parameter]
doio.c:205:27: warning: unused parameter 'my_perl' [-Wunused-parameter]
doio.c:224:27: warning: unused parameter 'my_perl' [-Wunused-parameter]
doio.c:239:28: warning: unused parameter 'my_perl' [-Wunused-parameter]
doio.c:285:28: warning: unused parameter 'my_perl' [-Wunused-parameter]
doio.c:307:30: warning: unused parameter 'my_perl' [-Wunused-parameter]
doio.c:321:30: warning: unused parameter 'my_perl' [-Wunused-parameter]
doio.c:347:34: warning: unused parameter 'my_perl' [-Wunused-parameter]
utf8.c:3412:21: warning: unused parameter 'my_perl' [-Wunused-parameter]
utf8.c:3540:13: warning: unused parameter 'my_perl' [-Wunused-parameter]
utf8.c:3621:13: warning: unused parameter 'my_perl' [-Wunused-parameter]
utf8.c:4481:21: warning: unused parameter 'my_perl' [-Wunused-parameter]
<scratch space>:4:1: note: expanded from here
./constants.h:24:11: warning: unused parameter 'my_perl' [-Wunused-parameter]
../../perl.h:182:18: note: expanded from macro 'pTHX_'
../../perl.h:169:22: note: expanded from macro 'pTHX'
Zlib.xs:301:5: warning: unused variable 'my_perl' [-Wunused-variable]
../../perl.h:180:19: note: expanded from macro 'dTHX'
Zlib.xs:696:5: warning: unused variable 'my_perl' [-Wunused-variable]
./constants.h:24:13: warning: unused parameter 'my_perl' [-Wunused-parameter]
./constants.h:101:13: warning: unused parameter 'my_perl' [-Wunused-parameter]
./constants.h:145:14: warning: unused parameter 'my_perl' [-Wunused-parameter]
./constants.h:189:14: warning: unused parameter 'my_perl' [-Wunused-parameter]
./constants.h:233:14: warning: unused parameter 'my_perl' [-Wunused-parameter]
Cwd.xs:452:22: warning: unused parameter 'my_perl' [-Wunused-parameter]
DB_File.xs:950:16: warning: unused parameter 'my_perl' [-Wunused-parameter]
./constants.h:79:13: warning: unused parameter 'my_perl' [-Wunused-parameter]
./constants.h:123:13: warning: unused parameter 'my_perl' [-Wunused-parameter]
./constants.h:167:13: warning: unused parameter 'my_perl' [-Wunused-parameter]
./constants.h:211:14: warning: unused parameter 'my_perl' [-Wunused-parameter]
./constants.h:266:14: warning: unused parameter 'my_perl' [-Wunused-parameter]
MD5.xs:132:24: warning: unused parameter 'my_perl' [-Wunused-parameter]
Unicode.xs:56:12: warning: unused parameter 'my_perl' [-Wunused-parameter]
../../../perl.h:182:18: note: expanded from macro 'pTHX_'
../../../perl.h:169:22: note: expanded from macro 'pTHX'
FieldHash.xs:115:25: warning: unused parameter 'my_perl' [-Wunused-parameter]
FieldHash.xs:267:16: warning: unused parameter 'my_perl' [-Wunused-parameter]
IO.xs:199:15: warning: unused parameter 'my_perl' [-Wunused-parameter]
./const-c.inc:24:14: warning: unused parameter 'my_perl' [-Wunused-parameter]
./const-c.inc:133:14: warning: unused parameter 'my_perl' [-Wunused-parameter]
./const-c.inc:248:14: warning: unused parameter 'my_perl' [-Wunused-parameter]
./const-c.inc:440:14: warning: unused parameter 'my_perl' [-Wunused-parameter]
./const-c.inc:644:14: warning: unused parameter 'my_perl' [-Wunused-parameter]
./const-c.inc:771:15: warning: unused parameter 'my_perl' [-Wunused-parameter]
./const-c.inc:939:15: warning: unused parameter 'my_perl' [-Wunused-parameter]
./const-c.inc:1003:12: warning: unused parameter 'my_perl' [-Wunused-parameter]
SysV.c:276:1: warning: unused parameter 'my_perl' [-Wunused-parameter]
SysV.c:221:26: note: expanded from macro 'XS_EUPXS'
../../XSUB.h:135:36: note: expanded from macro 'XS_INTERNAL'
../../XSUB.h:122:33: note: expanded from macro 'XSPROTO'
SysV.c:318:1: warning: unused parameter 'my_perl' [-Wunused-parameter]
SysV.c:363:1: warning: unused parameter 'my_perl' [-Wunused-parameter]
SysV.c:401:1: warning: unused parameter 'my_perl' [-Wunused-parameter]
SysV.c:442:1: warning: unused parameter 'my_perl' [-Wunused-parameter]
SysV.c:484:1: warning: unused parameter 'my_perl' [-Wunused-parameter]
SysV.c:529:1: warning: unused parameter 'my_perl' [-Wunused-parameter]
SysV.c:588:1: warning: unused parameter 'my_perl' [-Wunused-parameter]
SysV.c:627:1: warning: unused parameter 'my_perl' [-Wunused-parameter]
SysV.c:659:1: warning: unused parameter 'my_perl' [-Wunused-parameter]
SysV.c:693:1: warning: unused parameter 'my_perl' [-Wunused-parameter]
SysV.c:720:1: warning: unused parameter 'my_perl' [-Wunused-parameter]
SysV.c:830:1: warning: unused parameter 'my_perl' [-Wunused-parameter]
../../XSUB.h:134:40: note: expanded from macro 'XS_EXTERNAL'
POSIX.xs:1301:3: warning: unused variable 'my_perl' [-Wunused-variable]
POSIX.xs:1823:10: warning: unused parameter 'my_perl' [-Wunused-parameter]
<scratch space>:9:1: note: expanded from here
<scratch space>:12:1: note: expanded from here
scalar.xs:108:21: warning: unused parameter 'my_perl' [-Wunused-parameter]
scalar.xs:149:19: warning: unused parameter 'my_perl' [-Wunused-parameter]
scalar.xs:275:19: warning: unused parameter 'my_perl' [-Wunused-parameter]
scalar.xs:282:20: warning: unused parameter 'my_perl' [-Wunused-parameter]
via.xs:501:20: warning: unused parameter 'my_perl' [-Wunused-parameter]
via.xs:513:19: warning: unused parameter 'my_perl' [-Wunused-parameter]
via.xs:526:19: warning: unused parameter 'my_perl' [-Wunused-parameter]
via.xs:538:18: warning: unused parameter 'my_perl' [-Wunused-parameter]
via.xs:549:22: warning: unused parameter 'my_perl' [-Wunused-parameter]
Storable.xs:4285:20: warning: unused parameter 'my_perl' [-Wunused-parameter]
Storable.xs:4763:27: warning: unused parameter 'my_perl' [-Wunused-parameter]
./const-c.inc:24:21: warning: unused parameter 'my_perl' [-Wunused-parameter]
./const-c.inc:55:18: warning: unused parameter 'my_perl' [-Wunused-parameter]
Syslog.c:225:1: warning: unused parameter 'my_perl' [-Wunused-parameter]
Syslog.c:167:26: note: expanded from macro 'XS_EUPXS'
Syslog.c:265:1: warning: unused parameter 'my_perl' [-Wunused-parameter]
Syslog.c:284:1: warning: unused parameter 'my_perl' [-Wunused-parameter]
Syslog.c:303:1: warning: unused parameter 'my_perl' [-Wunused-parameter]
Syslog.c:324:1: warning: unused parameter 'my_perl' [-Wunused-parameter]
Syslog.c:343:1: warning: unused parameter 'my_perl' [-Wunused-parameter]
Syslog.c:365:1: warning: unused parameter 'my_perl' [-Wunused-parameter]
Syslog.c:392:1: warning: unused parameter 'my_perl' [-Wunused-parameter]
Syslog.c:411:1: warning: unused parameter 'my_perl' [-Wunused-parameter]
Syslog.c:431:1: warning: unused parameter 'my_perl' [-Wunused-parameter]
./const-xs.inc:4:5: warning: unused variable 'my_perl' [-Wunused-variable]
Syslog.c:533:1: warning: unused parameter 'my_perl' [-Wunused-parameter]
HiRes.xs:796:10: warning: unused parameter 'my_perl' [-Wunused-parameter]
./const-c.inc:103:14: warning: unused parameter 'my_perl' [-Wunused-parameter]
./const-c.inc:148:14: warning: unused parameter 'my_perl' [-Wunused-parameter]
./const-c.inc:204:14: warning: unused parameter 'my_perl' [-Wunused-parameter]
./const-c.inc:295:14: warning: unused parameter 'my_perl' [-Wunused-parameter]
./const-c.inc:351:14: warning: unused parameter 'my_perl' [-Wunused-parameter]
Piece.xs:146:10: warning: unused parameter 'my_perl' [-Wunused-parameter]
APItest.xs:103:13: warning: unused parameter 'my_perl' [-Wunused-parameter]
APItest.xs:218:13: warning: unused parameter 'my_perl' [-Wunused-parameter]
APItest.xs:263:11: warning: unused parameter 'my_perl' [-Wunused-parameter]
APItest.xs:348:18: warning: unused parameter 'my_perl' [-Wunused-parameter]
APItest.xs:362:21: warning: unused parameter 'my_perl' [-Wunused-parameter]
APItest.xs:383:23: warning: unused parameter 'my_perl' [-Wunused-parameter]
APItest.xs:397:22: warning: unused parameter 'my_perl' [-Wunused-parameter]
APItest.xs:411:24: warning: unused parameter 'my_perl' [-Wunused-parameter]
APItest.xs:421:25: warning: unused parameter 'my_perl' [-Wunused-parameter]
APItest.xs:431:21: warning: unused parameter 'my_perl' [-Wunused-parameter]
APItest.xs:447:10: warning: unused parameter 'my_perl' [-Wunused-parameter]
APItest.xs:467:11: warning: unused parameter 'my_perl' [-Wunused-parameter]
APItest.xs:487:28: warning: unused parameter 'my_perl' [-Wunused-parameter]
APItest.xs:495:30: warning: unused parameter 'my_perl' [-Wunused-parameter]
APItest.xs:509:27: warning: unused parameter 'my_perl' [-Wunused-parameter]
APItest.xs:574:12: warning: unused parameter 'my_perl' [-Wunused-parameter]
APItest.xs:585:13: warning: unused parameter 'my_perl' [-Wunused-parameter]
APItest.xs:597:14: warning: unused parameter 'my_perl' [-Wunused-parameter]
APItest.xs:627:17: warning: unused parameter 'my_perl' [-Wunused-parameter]
APItest.xs:641:26: warning: unused parameter 'my_perl' [-Wunused-parameter]
APItest.xs:653:35: warning: unused parameter 'my_perl' [-Wunused-parameter]
APItest.xs:675:25: warning: unused parameter 'my_perl' [-Wunused-parameter]
APItest.xs:693:28: warning: unused parameter 'my_perl' [-Wunused-parameter]
APItest.xs:776:26: warning: unused parameter 'my_perl' [-Wunused-parameter]
APItest.xs:804:31: warning: unused parameter 'my_perl' [-Wunused-parameter]
APItest.xs:873:34: warning: unused parameter 'my_perl' [-Wunused-parameter]
APItest.xs:888:38: warning: unused parameter 'my_perl' [-Wunused-parameter]
APItest.xs:905:40: warning: unused parameter 'my_perl' [-Wunused-parameter]
APItest.xs:926:43: warning: unused parameter 'my_perl' [-Wunused-parameter]
APItest.xs:937:39: warning: unused parameter 'my_perl' [-Wunused-parameter]
APItest.xs:944:45: warning: unused parameter 'my_perl' [-Wunused-parameter]
APItest.xs:959:41: warning: unused parameter 'my_perl' [-Wunused-parameter]
APItest.xs:968:42: warning: unused parameter 'my_perl' [-Wunused-parameter]
APItest.xs:984:40: warning: unused parameter 'my_perl' [-Wunused-parameter]
APItest.xs:991:42: warning: unused parameter 'my_perl' [-Wunused-parameter]
APItest.xs:1000:40: warning: unused parameter 'my_perl' [-Wunused-parameter]
APItest.xs:1011:41: warning: unused parameter 'my_perl' [-Wunused-parameter]
APItest.xs:1017:44: warning: unused parameter 'my_perl' [-Wunused-parameter]
APItest.xs:1023:44: warning: unused parameter 'my_perl' [-Wunused-parameter]
APItest.xs:1029:44: warning: unused parameter 'my_perl' [-Wunused-parameter]
APItest.xs:1035:45: warning: unused parameter 'my_perl' [-Wunused-parameter]
APItest.xs:1041:45: warning: unused parameter 'my_perl' [-Wunused-parameter]
APItest.xs:1056:43: warning: unused parameter 'my_perl' [-Wunused-parameter]
APItest.xs:1117:36: warning: unused parameter 'my_perl' [-Wunused-parameter]
APItest.xs:1123:26: warning: unused parameter 'my_perl' [-Wunused-parameter]
APItest.xs:1133:40: warning: unused parameter 'my_perl' [-Wunused-parameter]
APItest.xs:1207:38: warning: unused parameter 'my_perl' [-Wunused-parameter]
APItest.xs:1219:31: warning: unused parameter 'my_perl' [-Wunused-parameter]
APItest.xs:1228:30: warning: unused parameter 'my_perl' [-Wunused-parameter]
APItest.xs:1324:8: warning: unused parameter 'my_perl' [-Wunused-parameter]
APItest.xs:1330:10: warning: unused parameter 'my_perl' [-Wunused-parameter]
APItest.xs:1338:13: warning: unused parameter 'my_perl' [-Wunused-parameter]
APItest.xs:1356:18: warning: unused parameter 'my_perl' [-Wunused-parameter]
APItest.xs:1374:19: warning: unused parameter 'my_perl' [-Wunused-parameter]
APItest.xs:1394:13: warning: unused parameter 'my_perl' [-Wunused-parameter]
APItest.c:1575:1: warning: unused parameter 'my_perl' [-Wunused-parameter]
APItest.c:1517:26: note: expanded from macro 'XS_EUPXS'
APItest.c:1618:1: warning: unused parameter 'my_perl' [-Wunused-parameter]
APItest.c:1648:1: warning: unused parameter 'my_perl' [-Wunused-parameter]
APItest.c:1680:1: warning: unused parameter 'my_perl' [-Wunused-parameter]
APItest.c:1728:1: warning: unused parameter 'my_perl' [-Wunused-parameter]
APItest.c:1748:1: warning: unused parameter 'my_perl' [-Wunused-parameter]
APItest.c:1778:1: warning: unused parameter 'my_perl' [-Wunused-parameter]
APItest.c:1818:1: warning: unused parameter 'my_perl' [-Wunused-parameter]
APItest.c:1877:1: warning: unused parameter 'my_perl' [-Wunused-parameter]
APItest.c:1935:1: warning: unused parameter 'my_perl' [-Wunused-parameter]
APItest.c:1977:1: warning: unused parameter 'my_perl' [-Wunused-parameter]
APItest.c:2010:1: warning: unused parameter 'my_perl' [-Wunused-parameter]
APItest.c:2057:1: warning: unused parameter 'my_perl' [-Wunused-parameter]
APItest.c:2080:1: warning: unused parameter 'my_perl' [-Wunused-parameter]
APItest.c:2125:1: warning: unused parameter 'my_perl' [-Wunused-parameter]
APItest.c:2144:1: warning: unused parameter 'my_perl' [-Wunused-parameter]
APItest.c:2163:1: warning: unused parameter 'my_perl' [-Wunused-parameter]
APItest.c:2188:1: warning: unused parameter 'my_perl' [-Wunused-parameter]
APItest.c:2206:1: warning: unused parameter 'my_perl' [-Wunused-parameter]
APItest.c:2224:1: warning: unused parameter 'my_perl' [-Wunused-parameter]
APItest.c:2242:1: warning: unused parameter 'my_perl' [-Wunused-parameter]
APItest.c:2260:1: warning: unused parameter 'my_perl' [-Wunused-parameter]
APItest.c:2278:1: warning: unused parameter 'my_perl' [-Wunused-parameter]
APItest.c:2296:1: warning: unused parameter 'my_perl' [-Wunused-parameter]
APItest.c:2314:1: warning: unused parameter 'my_perl' [-Wunused-parameter]
APItest.c:2332:1: warning: unused parameter 'my_perl' [-Wunused-parameter]
APItest.c:2350:1: warning: unused parameter 'my_perl' [-Wunused-parameter]
APItest.c:2387:1: warning: unused parameter 'my_perl' [-Wunused-parameter]
APItest.c:2425:1: warning: unused parameter 'my_perl' [-Wunused-parameter]
APItest.c:2464:1: warning: unused parameter 'my_perl' [-Wunused-parameter]
APItest.c:2500:1: warning: unused parameter 'my_perl' [-Wunused-parameter]
APItest.c:2550:1: warning: unused parameter 'my_perl' [-Wunused-parameter]
APItest.c:2594:1: warning: unused parameter 'my_perl' [-Wunused-parameter]
APItest.c:2644:1: warning: unused parameter 'my_perl' [-Wunused-parameter]
APItest.c:2697:1: warning: unused parameter 'my_perl' [-Wunused-parameter]
APItest.c:2740:1: warning: unused parameter 'my_perl' [-Wunused-parameter]
APItest.c:2789:1: warning: unused parameter 'my_perl' [-Wunused-parameter]
APItest.c:2873:1: warning: unused parameter 'my_perl' [-Wunused-parameter]
APItest.c:2892:1: warning: unused parameter 'my_perl' [-Wunused-parameter]
APItest.c:2911:1: warning: unused parameter 'my_perl' [-Wunused-parameter]
APItest.c:2944:1: warning: unused parameter 'my_perl' [-Wunused-parameter]
APItest.c:2974:1: warning: unused parameter 'my_perl' [-Wunused-parameter]
APItest.c:3007:1: warning: unused parameter 'my_perl' [-Wunused-parameter]
APItest.c:3052:1: warning: unused parameter 'my_perl' [-Wunused-parameter]
APItest.c:3086:1: warning: unused parameter 'my_perl' [-Wunused-parameter]
APItest.c:3106:1: warning: unused parameter 'my_perl' [-Wunused-parameter]
APItest.c:3132:1: warning: unused parameter 'my_perl' [-Wunused-parameter]
APItest.c:3188:1: warning: unused parameter 'my_perl' [-Wunused-parameter]
APItest.c:3232:1: warning: unused parameter 'my_perl' [-Wunused-parameter]
APItest.c:3257:1: warning: unused parameter 'my_perl' [-Wunused-parameter]
APItest.c:3282:1: warning: unused parameter 'my_perl' [-Wunused-parameter]
APItest.c:3300:1: warning: unused parameter 'my_perl' [-Wunused-parameter]
APItest.c:3319:1: warning: unused parameter 'my_perl' [-Wunused-parameter]
APItest.c:3341:1: warning: unused parameter 'my_perl' [-Wunused-parameter]
APItest.c:3364:1: warning: unused parameter 'my_perl' [-Wunused-parameter]
APItest.c:3387:1: warning: unused parameter 'my_perl' [-Wunused-parameter]
APItest.c:3406:1: warning: unused parameter 'my_perl' [-Wunused-parameter]
APItest.c:3424:1: warning: unused parameter 'my_perl' [-Wunused-parameter]
APItest.c:3442:1: warning: unused parameter 'my_perl' [-Wunused-parameter]
APItest.c:3460:1: warning: unused parameter 'my_perl' [-Wunused-parameter]
APItest.c:3478:1: warning: unused parameter 'my_perl' [-Wunused-parameter]
APItest.c:3527:1: warning: unused parameter 'my_perl' [-Wunused-parameter]
APItest.c:3557:1: warning: unused parameter 'my_perl' [-Wunused-parameter]
APItest.c:3581:1: warning: unused parameter 'my_perl' [-Wunused-parameter]
APItest.c:3598:1: warning: unused parameter 'my_perl' [-Wunused-parameter]
APItest.c:3620:1: warning: unused parameter 'my_perl' [-Wunused-parameter]
APItest.c:3643:1: warning: unused parameter 'my_perl' [-Wunused-parameter]
APItest.c:3660:1: warning: unused parameter 'my_perl' [-Wunused-parameter]
APItest.c:3677:1: warning: unused parameter 'my_perl' [-Wunused-parameter]
APItest.c:3694:1: warning: unused parameter 'my_perl' [-Wunused-parameter]
APItest.c:3709:1: warning: unused parameter 'my_perl' [-Wunused-parameter]
APItest.c:3731:1: warning: unused parameter 'my_perl' [-Wunused-parameter]
APItest.c:3753:1: warning: unused parameter 'my_perl' [-Wunused-parameter]
APItest.c:3775:1: warning: unused parameter 'my_perl' [-Wunused-parameter]
APItest.c:3797:1: warning: unused parameter 'my_perl' [-Wunused-parameter]
APItest.c:3818:1: warning: unused parameter 'my_perl' [-Wunused-parameter]
APItest.c:3839:1: warning: unused parameter 'my_perl' [-Wunused-parameter]
APItest.c:3860:1: warning: unused parameter 'my_perl' [-Wunused-parameter]
APItest.c:3881:1: warning: unused parameter 'my_perl' [-Wunused-parameter]
APItest.c:3918:1: warning: unused parameter 'my_perl' [-Wunused-parameter]
APItest.c:4011:1: warning: unused parameter 'my_perl' [-Wunused-parameter]
APItest.c:4044:1: warning: unused parameter 'my_perl' [-Wunused-parameter]
APItest.c:4077:1: warning: unused parameter 'my_perl' [-Wunused-parameter]
APItest.c:4110:1: warning: unused parameter 'my_perl' [-Wunused-parameter]
APItest.c:4143:1: warning: unused parameter 'my_perl' [-Wunused-parameter]
APItest.c:4201:1: warning: unused parameter 'my_perl' [-Wunused-parameter]
APItest.c:4249:1: warning: unused parameter 'my_perl' [-Wunused-parameter]
APItest.c:4309:1: warning: unused parameter 'my_perl' [-Wunused-parameter]
APItest.c:4369:1: warning: unused parameter 'my_perl' [-Wunused-parameter]
APItest.c:4431:1: warning: unused parameter 'my_perl' [-Wunused-parameter]
APItest.c:4490:1: warning: unused parameter 'my_perl' [-Wunused-parameter]
APItest.c:4524:1: warning: unused parameter 'my_perl' [-Wunused-parameter]
APItest.c:4565:1: warning: unused parameter 'my_perl' [-Wunused-parameter]
APItest.c:4594:1: warning: unused parameter 'my_perl' [-Wunused-parameter]
APItest.c:4618:1: warning: unused parameter 'my_perl' [-Wunused-parameter]
APItest.c:4639:1: warning: unused parameter 'my_perl' [-Wunused-parameter]
APItest.c:4658:1: warning: unused parameter 'my_perl' [-Wunused-parameter]
APItest.c:4680:1: warning: unused parameter 'my_perl' [-Wunused-parameter]
APItest.c:4698:1: warning: unused parameter 'my_perl' [-Wunused-parameter]
APItest.c:4717:1: warning: unused parameter 'my_perl' [-Wunused-parameter]
APItest.c:4735:1: warning: unused parameter 'my_perl' [-Wunused-parameter]
APItest.c:4757:1: warning: unused parameter 'my_perl' [-Wunused-parameter]
APItest.c:4777:1: warning: unused parameter 'my_perl' [-Wunused-parameter]
APItest.c:4793:1: warning: unused parameter 'my_perl' [-Wunused-parameter]
APItest.c:4809:1: warning: unused parameter 'my_perl' [-Wunused-parameter]
APItest.c:4840:1: warning: unused parameter 'my_perl' [-Wunused-parameter]
APItest.c:4876:1: warning: unused parameter 'my_perl' [-Wunused-parameter]
APItest.c:4902:1: warning: unused parameter 'my_perl' [-Wunused-parameter]
APItest.c:4949:1: warning: unused parameter 'my_perl' [-Wunused-parameter]
APItest.c:4970:1: warning: unused parameter 'my_perl' [-Wunused-parameter]
APItest.c:4985:1: warning: unused parameter 'my_perl' [-Wunused-parameter]
APItest.c:5000:1: warning: unused parameter 'my_perl' [-Wunused-parameter]
APItest.c:5015:1: warning: unused parameter 'my_perl' [-Wunused-parameter]
APItest.c:5030:1: warning: unused parameter 'my_perl' [-Wunused-parameter]
APItest.c:5045:1: warning: unused parameter 'my_perl' [-Wunused-parameter]
APItest.c:5086:1: warning: unused parameter 'my_perl' [-Wunused-parameter]
APItest.c:5106:1: warning: unused parameter 'my_perl' [-Wunused-parameter]
APItest.c:5129:1: warning: unused parameter 'my_perl' [-Wunused-parameter]
APItest.c:5147:1: warning: unused parameter 'my_perl' [-Wunused-parameter]
APItest.c:5167:1: warning: unused parameter 'my_perl' [-Wunused-parameter]
APItest.c:5243:1: warning: unused parameter 'my_perl' [-Wunused-parameter]
APItest.c:5279:1: warning: unused parameter 'my_perl' [-Wunused-parameter]
APItest.c:5349:1: warning: unused parameter 'my_perl' [-Wunused-parameter]
APItest.c:5422:1: warning: unused parameter 'my_perl' [-Wunused-parameter]
APItest.c:5452:1: warning: unused parameter 'my_perl' [-Wunused-parameter]
APItest.c:5482:1: warning: unused parameter 'my_perl' [-Wunused-parameter]
APItest.c:5516:1: warning: unused parameter 'my_perl' [-Wunused-parameter]
APItest.c:5550:1: warning: unused parameter 'my_perl' [-Wunused-parameter]
APItest.c:5580:1: warning: unused parameter 'my_perl' [-Wunused-parameter]
APItest.c:5746:1: warning: unused parameter 'my_perl' [-Wunused-parameter]
APItest.c:5778:1: warning: unused parameter 'my_perl' [-Wunused-parameter]
APItest.c:5841:1: warning: unused parameter 'my_perl' [-Wunused-parameter]
APItest.c:5900:1: warning: unused parameter 'my_perl' [-Wunused-parameter]
APItest.c:5934:1: warning: unused parameter 'my_perl' [-Wunused-parameter]
APItest.c:6061:1: warning: unused parameter 'my_perl' [-Wunused-parameter]
APItest.c:6126:1: warning: unused parameter 'my_perl' [-Wunused-parameter]
APItest.c:6146:1: warning: unused parameter 'my_perl' [-Wunused-parameter]
APItest.c:6164:1: warning: unused parameter 'my_perl' [-Wunused-parameter]
APItest.c:6185:1: warning: unused parameter 'my_perl' [-Wunused-parameter]
APItest.c:6206:1: warning: unused parameter 'my_perl' [-Wunused-parameter]
APItest.c:6248:1: warning: unused parameter 'my_perl' [-Wunused-parameter]
APItest.c:6317:1: warning: unused parameter 'my_perl' [-Wunused-parameter]
APItest.c:6382:1: warning: unused parameter 'my_perl' [-Wunused-parameter]
APItest.c:6415:1: warning: unused parameter 'my_perl' [-Wunused-parameter]
APItest.c:6448:1: warning: unused parameter 'my_perl' [-Wunused-parameter]
APItest.c:6481:1: warning: unused parameter 'my_perl' [-Wunused-parameter]
APItest.c:6514:1: warning: unused parameter 'my_perl' [-Wunused-parameter]
APItest.c:6530:1: warning: unused parameter 'my_perl' [-Wunused-parameter]
APItest.c:6546:1: warning: unused parameter 'my_perl' [-Wunused-parameter]
APItest.c:6561:1: warning: unused parameter 'my_perl' [-Wunused-parameter]
APItest.c:6583:1: warning: unused parameter 'my_perl' [-Wunused-parameter]
APItest.c:6620:1: warning: unused parameter 'my_perl' [-Wunused-parameter]
APItest.c:6657:1: warning: unused parameter 'my_perl' [-Wunused-parameter]
APItest.c:6677:1: warning: unused parameter 'my_perl' [-Wunused-parameter]
APItest.c:6693:1: warning: unused parameter 'my_perl' [-Wunused-parameter]
APItest.c:6740:1: warning: unused parameter 'my_perl' [-Wunused-parameter]
APItest.c:6765:1: warning: unused parameter 'my_perl' [-Wunused-parameter]
APItest.c:6782:1: warning: unused parameter 'my_perl' [-Wunused-parameter]
APItest.c:6820:1: warning: unused parameter 'my_perl' [-Wunused-parameter]
APItest.c:6846:1: warning: unused parameter 'my_perl' [-Wunused-parameter]
APItest.c:6870:1: warning: unused parameter 'my_perl' [-Wunused-parameter]
APItest.c:6890:1: warning: unused parameter 'my_perl' [-Wunused-parameter]
APItest.c:6910:1: warning: unused parameter 'my_perl' [-Wunused-parameter]
APItest.c:6930:1: warning: unused parameter 'my_perl' [-Wunused-parameter]
APItest.c:6950:1: warning: unused parameter 'my_perl' [-Wunused-parameter]
APItest.c:6965:1: warning: unused parameter 'my_perl' [-Wunused-parameter]
APItest.c:6983:1: warning: unused parameter 'my_perl' [-Wunused-parameter]
APItest.c:7001:1: warning: unused parameter 'my_perl' [-Wunused-parameter]
APItest.c:7037:1: warning: unused parameter 'my_perl' [-Wunused-parameter]
APItest.c:7081:1: warning: unused parameter 'my_perl' [-Wunused-parameter]
APItest.c:7130:1: warning: unused parameter 'my_perl' [-Wunused-parameter]
APItest.c:7150:1: warning: unused parameter 'my_perl' [-Wunused-parameter]
APItest.c:7169:1: warning: unused parameter 'my_perl' [-Wunused-parameter]
APItest.c:7203:1: warning: unused parameter 'my_perl' [-Wunused-parameter]
APItest.c:7240:1: warning: unused parameter 'my_perl' [-Wunused-parameter]
APItest.c:7263:1: warning: unused parameter 'my_perl' [-Wunused-parameter]
APItest.c:7317:1: warning: unused parameter 'my_perl' [-Wunused-parameter]
APItest.c:7340:1: warning: unused parameter 'my_perl' [-Wunused-parameter]
APItest.c:7365:1: warning: unused parameter 'my_perl' [-Wunused-parameter]
APItest.c:7390:1: warning: unused parameter 'my_perl' [-Wunused-parameter]
APItest.c:7418:1: warning: unused parameter 'my_perl' [-Wunused-parameter]
APItest.c:7448:1: warning: unused parameter 'my_perl' [-Wunused-parameter]
APItest.c:7467:1: warning: unused parameter 'my_perl' [-Wunused-parameter]
APItest.c:7496:1: warning: unused parameter 'my_perl' [-Wunused-parameter]
APItest.c:7525:1: warning: unused parameter 'my_perl' [-Wunused-parameter]
APItest.c:7556:1: warning: unused parameter 'my_perl' [-Wunused-parameter]
APItest.c:7590:1: warning: unused parameter 'my_perl' [-Wunused-parameter]
APItest.c:7624:1: warning: unused parameter 'my_perl' [-Wunused-parameter]
APItest.c:7644:1: warning: unused parameter 'my_perl' [-Wunused-parameter]
APItest.c:7666:1: warning: unused parameter 'my_perl' [-Wunused-parameter]
APItest.c:7684:1: warning: unused parameter 'my_perl' [-Wunused-parameter]
APItest.c:7703:1: warning: unused parameter 'my_perl' [-Wunused-parameter]
APItest.c:7760:1: warning: unused parameter 'my_perl' [-Wunused-parameter]
APItest.c:7780:1: warning: unused parameter 'my_perl' [-Wunused-parameter]
APItest.c:7799:1: warning: unused parameter 'my_perl' [-Wunused-parameter]
APItest.c:7818:1: warning: unused parameter 'my_perl' [-Wunused-parameter]
APItest.c:7837:1: warning: unused parameter 'my_perl' [-Wunused-parameter]
APItest.c:7856:1: warning: unused parameter 'my_perl' [-Wunused-parameter]
APItest.c:7875:1: warning: unused parameter 'my_perl' [-Wunused-parameter]
APItest.c:7894:1: warning: unused parameter 'my_perl' [-Wunused-parameter]
APItest.c:7913:1: warning: unused parameter 'my_perl' [-Wunused-parameter]
APItest.c:7946:1: warning: unused parameter 'my_perl' [-Wunused-parameter]
APItest.c:7976:1: warning: unused parameter 'my_perl' [-Wunused-parameter]
APItest.c:7995:1: warning: unused parameter 'my_perl' [-Wunused-parameter]
APItest.c:8014:1: warning: unused parameter 'my_perl' [-Wunused-parameter]
APItest.c:8044:1: warning: unused parameter 'my_perl' [-Wunused-parameter]
APItest.c:8063:1: warning: unused parameter 'my_perl' [-Wunused-parameter]
APItest.c:8082:1: warning: unused parameter 'my_perl' [-Wunused-parameter]
APItest.c:8101:1: warning: unused parameter 'my_perl' [-Wunused-parameter]
APItest.c:8120:1: warning: unused parameter 'my_perl' [-Wunused-parameter]
APItest.c:8139:1: warning: unused parameter 'my_perl' [-Wunused-parameter]
APItest.c:8158:1: warning: unused parameter 'my_perl' [-Wunused-parameter]
APItest.c:8177:1: warning: unused parameter 'my_perl' [-Wunused-parameter]
APItest.c:8207:1: warning: unused parameter 'my_perl' [-Wunused-parameter]
APItest.c:8237:1: warning: unused parameter 'my_perl' [-Wunused-parameter]
APItest.c:8256:1: warning: unused parameter 'my_perl' [-Wunused-parameter]
APItest.c:8275:1: warning: unused parameter 'my_perl' [-Wunused-parameter]
APItest.c:8294:1: warning: unused parameter 'my_perl' [-Wunused-parameter]
APItest.c:8313:1: warning: unused parameter 'my_perl' [-Wunused-parameter]
APItest.c:8332:1: warning: unused parameter 'my_perl' [-Wunused-parameter]
APItest.c:8351:1: warning: unused parameter 'my_perl' [-Wunused-parameter]
APItest.c:8370:1: warning: unused parameter 'my_perl' [-Wunused-parameter]
APItest.c:8400:1: warning: unused parameter 'my_perl' [-Wunused-parameter]
APItest.c:8430:1: warning: unused parameter 'my_perl' [-Wunused-parameter]
APItest.c:8449:1: warning: unused parameter 'my_perl' [-Wunused-parameter]
APItest.c:8468:1: warning: unused parameter 'my_perl' [-Wunused-parameter]
APItest.c:8487:1: warning: unused parameter 'my_perl' [-Wunused-parameter]
APItest.c:8506:1: warning: unused parameter 'my_perl' [-Wunused-parameter]
APItest.c:8525:1: warning: unused parameter 'my_perl' [-Wunused-parameter]
APItest.c:8544:1: warning: unused parameter 'my_perl' [-Wunused-parameter]
APItest.c:8563:1: warning: unused parameter 'my_perl' [-Wunused-parameter]
APItest.c:8593:1: warning: unused parameter 'my_perl' [-Wunused-parameter]
APItest.c:8623:1: warning: unused parameter 'my_perl' [-Wunused-parameter]
APItest.c:8642:1: warning: unused parameter 'my_perl' [-Wunused-parameter]
APItest.c:8661:1: warning: unused parameter 'my_perl' [-Wunused-parameter]
APItest.c:8680:1: warning: unused parameter 'my_perl' [-Wunused-parameter]
APItest.c:8699:1: warning: unused parameter 'my_perl' [-Wunused-parameter]
APItest.c:8718:1: warning: unused parameter 'my_perl' [-Wunused-parameter]
APItest.c:8737:1: warning: unused parameter 'my_perl' [-Wunused-parameter]
APItest.c:8756:1: warning: unused parameter 'my_perl' [-Wunused-parameter]
APItest.c:8786:1: warning: unused parameter 'my_perl' [-Wunused-parameter]
APItest.c:8816:1: warning: unused parameter 'my_perl' [-Wunused-parameter]
APItest.c:8835:1: warning: unused parameter 'my_perl' [-Wunused-parameter]
APItest.c:8854:1: warning: unused parameter 'my_perl' [-Wunused-parameter]
APItest.c:8873:1: warning: unused parameter 'my_perl' [-Wunused-parameter]
APItest.c:8892:1: warning: unused parameter 'my_perl' [-Wunused-parameter]
APItest.c:8911:1: warning: unused parameter 'my_perl' [-Wunused-parameter]
APItest.c:8930:1: warning: unused parameter 'my_perl' [-Wunused-parameter]
APItest.c:8949:1: warning: unused parameter 'my_perl' [-Wunused-parameter]
APItest.c:8979:1: warning: unused parameter 'my_perl' [-Wunused-parameter]
APItest.c:9009:1: warning: unused parameter 'my_perl' [-Wunused-parameter]
APItest.c:9028:1: warning: unused parameter 'my_perl' [-Wunused-parameter]
APItest.c:9047:1: warning: unused parameter 'my_perl' [-Wunused-parameter]
APItest.c:9066:1: warning: unused parameter 'my_perl' [-Wunused-parameter]
APItest.c:9085:1: warning: unused parameter 'my_perl' [-Wunused-parameter]
APItest.c:9115:1: warning: unused parameter 'my_perl' [-Wunused-parameter]
APItest.c:9145:1: warning: unused parameter 'my_perl' [-Wunused-parameter]
APItest.c:9164:1: warning: unused parameter 'my_perl' [-Wunused-parameter]
APItest.c:9183:1: warning: unused parameter 'my_perl' [-Wunused-parameter]
APItest.c:9202:1: warning: unused parameter 'my_perl' [-Wunused-parameter]
APItest.c:9232:1: warning: unused parameter 'my_perl' [-Wunused-parameter]
APItest.c:9262:1: warning: unused parameter 'my_perl' [-Wunused-parameter]
APItest.c:9281:1: warning: unused parameter 'my_perl' [-Wunused-parameter]
APItest.c:9300:1: warning: unused parameter 'my_perl' [-Wunused-parameter]
APItest.c:9319:1: warning: unused parameter 'my_perl' [-Wunused-parameter]
APItest.c:9338:1: warning: unused parameter 'my_perl' [-Wunused-parameter]
APItest.c:9357:1: warning: unused parameter 'my_perl' [-Wunused-parameter]
APItest.c:9376:1: warning: unused parameter 'my_perl' [-Wunused-parameter]
APItest.c:9395:1: warning: unused parameter 'my_perl' [-Wunused-parameter]
APItest.c:9414:1: warning: unused parameter 'my_perl' [-Wunused-parameter]
APItest.c:9433:1: warning: unused parameter 'my_perl' [-Wunused-parameter]
APItest.c:9452:1: warning: unused parameter 'my_perl' [-Wunused-parameter]
APItest.c:9471:1: warning: unused parameter 'my_perl' [-Wunused-parameter]
APItest.c:9490:1: warning: unused parameter 'my_perl' [-Wunused-parameter]
APItest.c:9509:1: warning: unused parameter 'my_perl' [-Wunused-parameter]
APItest.c:9528:1: warning: unused parameter 'my_perl' [-Wunused-parameter]
APItest.c:9558:1: warning: unused parameter 'my_perl' [-Wunused-parameter]
APItest.c:9588:1: warning: unused parameter 'my_perl' [-Wunused-parameter]
APItest.c:9607:1: warning: unused parameter 'my_perl' [-Wunused-parameter]
APItest.c:9626:1: warning: unused parameter 'my_perl' [-Wunused-parameter]
APItest.c:9645:1: warning: unused parameter 'my_perl' [-Wunused-parameter]
APItest.c:9664:1: warning: unused parameter 'my_perl' [-Wunused-parameter]
APItest.c:9683:1: warning: unused parameter 'my_perl' [-Wunused-parameter]
APItest.c:9702:1: warning: unused parameter 'my_perl' [-Wunused-parameter]
APItest.c:9721:1: warning: unused parameter 'my_perl' [-Wunused-parameter]
APItest.c:9751:1: warning: unused parameter 'my_perl' [-Wunused-parameter]
APItest.c:9781:1: warning: unused parameter 'my_perl' [-Wunused-parameter]
APItest.c:9800:1: warning: unused parameter 'my_perl' [-Wunused-parameter]
APItest.c:9819:1: warning: unused parameter 'my_perl' [-Wunused-parameter]
APItest.c:9838:1: warning: unused parameter 'my_perl' [-Wunused-parameter]
APItest.c:9857:1: warning: unused parameter 'my_perl' [-Wunused-parameter]
APItest.c:9876:1: warning: unused parameter 'my_perl' [-Wunused-parameter]
APItest.c:9895:1: warning: unused parameter 'my_perl' [-Wunused-parameter]
APItest.c:9914:1: warning: unused parameter 'my_perl' [-Wunused-parameter]
APItest.c:9944:1: warning: unused parameter 'my_perl' [-Wunused-parameter]
APItest.c:9974:1: warning: unused parameter 'my_perl' [-Wunused-parameter]
APItest.c:9993:1: warning: unused parameter 'my_perl' [-Wunused-parameter]
APItest.c:10012:1: warning: unused parameter 'my_perl' [-Wunused-parameter]
APItest.c:10031:1: warning: unused parameter 'my_perl' [-Wunused-parameter]
APItest.c:10050:1: warning: unused parameter 'my_perl' [-Wunused-parameter]
APItest.c:10069:1: warning: unused parameter 'my_perl' [-Wunused-parameter]
APItest.c:10088:1: warning: unused parameter 'my_perl' [-Wunused-parameter]
APItest.c:10107:1: warning: unused parameter 'my_perl' [-Wunused-parameter]
APItest.c:10140:1: warning: unused parameter 'my_perl' [-Wunused-parameter]
APItest.c:10173:1: warning: unused parameter 'my_perl' [-Wunused-parameter]
APItest.c:10192:1: warning: unused parameter 'my_perl' [-Wunused-parameter]
APItest.c:10211:1: warning: unused parameter 'my_perl' [-Wunused-parameter]
APItest.c:10230:1: warning: unused parameter 'my_perl' [-Wunused-parameter]
APItest.c:10249:1: warning: unused parameter 'my_perl' [-Wunused-parameter]
APItest.c:10268:1: warning: unused parameter 'my_perl' [-Wunused-parameter]
APItest.c:10287:1: warning: unused parameter 'my_perl' [-Wunused-parameter]
APItest.c:10306:1: warning: unused parameter 'my_perl' [-Wunused-parameter]
APItest.c:10336:1: warning: unused parameter 'my_perl' [-Wunused-parameter]
APItest.c:10366:1: warning: unused parameter 'my_perl' [-Wunused-parameter]
APItest.c:10385:1: warning: unused parameter 'my_perl' [-Wunused-parameter]
APItest.c:10404:1: warning: unused parameter 'my_perl' [-Wunused-parameter]
APItest.c:10423:1: warning: unused parameter 'my_perl' [-Wunused-parameter]
APItest.c:10442:1: warning: unused parameter 'my_perl' [-Wunused-parameter]
APItest.c:10461:1: warning: unused parameter 'my_perl' [-Wunused-parameter]
APItest.c:10480:1: warning: unused parameter 'my_perl' [-Wunused-parameter]
APItest.c:10499:1: warning: unused parameter 'my_perl' [-Wunused-parameter]
APItest.c:10529:1: warning: unused parameter 'my_perl' [-Wunused-parameter]
APItest.c:10559:1: warning: unused parameter 'my_perl' [-Wunused-parameter]
APItest.c:10578:1: warning: unused parameter 'my_perl' [-Wunused-parameter]
APItest.c:10597:1: warning: unused parameter 'my_perl' [-Wunused-parameter]
APItest.c:10616:1: warning: unused parameter 'my_perl' [-Wunused-parameter]
APItest.c:10635:1: warning: unused parameter 'my_perl' [-Wunused-parameter]
APItest.c:10654:1: warning: unused parameter 'my_perl' [-Wunused-parameter]
APItest.c:10673:1: warning: unused parameter 'my_perl' [-Wunused-parameter]
APItest.c:10692:1: warning: unused parameter 'my_perl' [-Wunused-parameter]
APItest.c:10722:1: warning: unused parameter 'my_perl' [-Wunused-parameter]
APItest.c:10752:1: warning: unused parameter 'my_perl' [-Wunused-parameter]
APItest.c:10771:1: warning: unused parameter 'my_perl' [-Wunused-parameter]
APItest.c:10790:1: warning: unused parameter 'my_perl' [-Wunused-parameter]
APItest.c:10809:1: warning: unused parameter 'my_perl' [-Wunused-parameter]
APItest.c:10828:1: warning: unused parameter 'my_perl' [-Wunused-parameter]
APItest.c:10847:1: warning: unused parameter 'my_perl' [-Wunused-parameter]
APItest.c:10866:1: warning: unused parameter 'my_perl' [-Wunused-parameter]
APItest.c:10885:1: warning: unused parameter 'my_perl' [-Wunused-parameter]
APItest.c:10915:1: warning: unused parameter 'my_perl' [-Wunused-parameter]
APItest.c:10945:1: warning: unused parameter 'my_perl' [-Wunused-parameter]
APItest.c:10964:1: warning: unused parameter 'my_perl' [-Wunused-parameter]
APItest.c:10983:1: warning: unused parameter 'my_perl' [-Wunused-parameter]
APItest.c:11002:1: warning: unused parameter 'my_perl' [-Wunused-parameter]
APItest.c:11021:1: warning: unused parameter 'my_perl' [-Wunused-parameter]
APItest.c:11040:1: warning: unused parameter 'my_perl' [-Wunused-parameter]
APItest.c:11059:1: warning: unused parameter 'my_perl' [-Wunused-parameter]
APItest.c:11078:1: warning: unused parameter 'my_perl' [-Wunused-parameter]
APItest.c:11108:1: warning: unused parameter 'my_perl' [-Wunused-parameter]
APItest.c:11138:1: warning: unused parameter 'my_perl' [-Wunused-parameter]
APItest.c:11157:1: warning: unused parameter 'my_perl' [-Wunused-parameter]
APItest.c:11176:1: warning: unused parameter 'my_perl' [-Wunused-parameter]
APItest.c:11195:1: warning: unused parameter 'my_perl' [-Wunused-parameter]
APItest.c:11214:1: warning: unused parameter 'my_perl' [-Wunused-parameter]
APItest.c:11233:1: warning: unused parameter 'my_perl' [-Wunused-parameter]
APItest.c:11252:1: warning: unused parameter 'my_perl' [-Wunused-parameter]
APItest.c:11271:1: warning: unused parameter 'my_perl' [-Wunused-parameter]
APItest.c:11301:1: warning: unused parameter 'my_perl' [-Wunused-parameter]
APItest.c:11331:1: warning: unused parameter 'my_perl' [-Wunused-parameter]
APItest.c:11350:1: warning: unused parameter 'my_perl' [-Wunused-parameter]
APItest.c:11370:1: warning: unused parameter 'my_perl' [-Wunused-parameter]
APItest.c:11389:1: warning: unused parameter 'my_perl' [-Wunused-parameter]
APItest.c:11408:1: warning: unused parameter 'my_perl' [-Wunused-parameter]
APItest.c:11427:1: warning: unused parameter 'my_perl' [-Wunused-parameter]
APItest.c:11447:1: warning: unused parameter 'my_perl' [-Wunused-parameter]
APItest.c:11467:1: warning: unused parameter 'my_perl' [-Wunused-parameter]
APItest.c:11486:1: warning: unused parameter 'my_perl' [-Wunused-parameter]
APItest.c:11505:1: warning: unused parameter 'my_perl' [-Wunused-parameter]
APItest.c:11524:1: warning: unused parameter 'my_perl' [-Wunused-parameter]
APItest.c:11543:1: warning: unused parameter 'my_perl' [-Wunused-parameter]
APItest.c:11562:1: warning: unused parameter 'my_perl' [-Wunused-parameter]
APItest.c:11581:1: warning: unused parameter 'my_perl' [-Wunused-parameter]
APItest.c:11603:1: warning: unused parameter 'my_perl' [-Wunused-parameter]
APItest.c:11627:1: warning: unused parameter 'my_perl' [-Wunused-parameter]
APItest.c:11649:1: warning: unused parameter 'my_perl' [-Wunused-parameter]
APItest.c:11671:1: warning: unused parameter 'my_perl' [-Wunused-parameter]
APItest.c:11697:1: warning: unused parameter 'my_perl' [-Wunused-parameter]
APItest.c:11720:1: warning: unused parameter 'my_perl' [-Wunused-parameter]
APItest.c:11763:1: warning: unused parameter 'my_perl' [-Wunused-parameter]
APItest.c:11793:1: warning: unused parameter 'my_perl' [-Wunused-parameter]
APItest.c:11817:1: warning: unused parameter 'my_perl' [-Wunused-parameter]
APItest.c:11850:1: warning: unused parameter 'my_perl' [-Wunused-parameter]
APItest.c:11885:1: warning: unused parameter 'my_perl' [-Wunused-parameter]
APItest.c:11909:1: warning: unused parameter 'my_perl' [-Wunused-parameter]
APItest.c:11944:1: warning: unused parameter 'my_perl' [-Wunused-parameter]
APItest.c:11981:1: warning: unused parameter 'my_perl' [-Wunused-parameter]
APItest.c:12003:1: warning: unused parameter 'my_perl' [-Wunused-parameter]
APItest.c:12036:1: warning: unused parameter 'my_perl' [-Wunused-parameter]
APItest.c:12071:1: warning: unused parameter 'my_perl' [-Wunused-parameter]
APItest.c:12093:1: warning: unused parameter 'my_perl' [-Wunused-parameter]
APItest.c:12126:1: warning: unused parameter 'my_perl' [-Wunused-parameter]
APItest.c:12161:1: warning: unused parameter 'my_perl' [-Wunused-parameter]
APItest.c:12185:1: warning: unused parameter 'my_perl' [-Wunused-parameter]
APItest.c:12220:1: warning: unused parameter 'my_perl' [-Wunused-parameter]
APItest.c:12257:1: warning: unused parameter 'my_perl' [-Wunused-parameter]
APItest.c:12288:1: warning: unused parameter 'my_perl' [-Wunused-parameter]
APItest.c:12308:1: warning: unused parameter 'my_perl' [-Wunused-parameter]
APItest.c:12328:1: warning: unused parameter 'my_perl' [-Wunused-parameter]
APItest.c:12348:1: warning: unused parameter 'my_perl' [-Wunused-parameter]
APItest.c:12386:1: warning: unused parameter 'my_perl' [-Wunused-parameter]
APItest.c:12424:1: warning: unused parameter 'my_perl' [-Wunused-parameter]
APItest.c:12475:1: warning: unused parameter 'my_perl' [-Wunused-parameter]
APItest.c:12495:1: warning: unused parameter 'my_perl' [-Wunused-parameter]
APItest.c:12515:1: warning: unused parameter 'my_perl' [-Wunused-parameter]
APItest.c:12553:1: warning: unused parameter 'my_perl' [-Wunused-parameter]
APItest.c:12591:1: warning: unused parameter 'my_perl' [-Wunused-parameter]
APItest.c:12642:1: warning: unused parameter 'my_perl' [-Wunused-parameter]
APItest.c:12662:1: warning: unused parameter 'my_perl' [-Wunused-parameter]
APItest.c:12682:1: warning: unused parameter 'my_perl' [-Wunused-parameter]
APItest.c:12720:1: warning: unused parameter 'my_perl' [-Wunused-parameter]
APItest.c:12758:1: warning: unused parameter 'my_perl' [-Wunused-parameter]
APItest.c:12809:1: warning: unused parameter 'my_perl' [-Wunused-parameter]
APItest.c:12829:1: warning: unused parameter 'my_perl' [-Wunused-parameter]
APItest.c:12867:1: warning: unused parameter 'my_perl' [-Wunused-parameter]
APItest.c:12905:1: warning: unused parameter 'my_perl' [-Wunused-parameter]
APItest.c:12956:1: warning: unused parameter 'my_perl' [-Wunused-parameter]
APItest.c:12988:1: warning: unused parameter 'my_perl' [-Wunused-parameter]
APItest.c:13008:1: warning: unused parameter 'my_perl' [-Wunused-parameter]
APItest.c:13025:1: warning: unused parameter 'my_perl' [-Wunused-parameter]
APItest.c:13143:1: warning: unused parameter 'my_perl' [-Wunused-parameter]
XSUB-undef-XS_VERSION.c:174:1: warning: unused parameter 'my_perl' [-Wunused-parameter]
XSUB-undef-XS_VERSION.c:170:26: note: expanded from macro 'XS_EUPXS'
XSUB-undef-XS_VERSION.c:195:1: warning: unused parameter 'my_perl' [-Wunused-parameter]
XSUB-redefined-macros.c:177:1: warning: unused parameter 'my_perl' [-Wunused-parameter]
XSUB-redefined-macros.c:173:26: note: expanded from macro 'XS_EUPXS'
XSUB-redefined-macros.c:196:1: warning: unused parameter 'my_perl' [-Wunused-parameter]
XSUB-redefined-macros.c:217:1: warning: unused parameter 'my_perl' [-Wunused-parameter]
re_comp.c:4472:22: warning: unused parameter 'my_perl' [-Wunused-parameter]
threads.xs:339:21: warning: unused parameter 'my_perl' [-Wunused-parameter]
threads.xs:390:16: warning: unused parameter 'my_perl' [-Wunused-parameter]
shared.xs:203:21: warning: unused parameter 'my_perl' [-Wunused-parameter]
shared.xs:211:24: warning: unused parameter 'my_perl' [-Wunused-parameter]
shared.xs:910:24: warning: unused parameter 'my_perl' [-Wunused-parameter]
shared.xs:1207:23: warning: unused parameter 'my_perl' [-Wunused-parameter]
ExtTest.xs:30:13: warning: unused parameter 'my_perl' [-Wunused-parameter]
../../../../perl.h:182:18: note: expanded from macro 'pTHX_'
../../../../perl.h:169:22: note: expanded from macro 'pTHX'
ExtTest.xs:89:13: warning: unused parameter 'my_perl' [-Wunused-parameter]
ExtTest.xs:165:13: warning: unused parameter 'my_perl' [-Wunused-parameter]
ExtTest.xs:206:13: warning: unused parameter 'my_perl' [-Wunused-parameter]
ExtTest.xs:246:11: warning: unused parameter 'my_perl' [-Wunused-parameter]
ExtTest.c:562:1: warning: unused parameter 'my_perl' [-Wunused-parameter]
ExtTest.c:507:26: note: expanded from macro 'XS_EUPXS'
../../../../XSUB.h:135:36: note: expanded from macro 'XS_INTERNAL'
../../../../XSUB.h:122:33: note: expanded from macro 'XSPROTO'
ExtTest.c:661:1: warning: unused parameter 'my_perl' [-Wunused-parameter]
../../../../XSUB.h:134:40: note: expanded from macro 'XS_EXTERNAL'
ExtTest.xs:30:21: warning: unused parameter 'my_perl' [-Wunused-parameter]
ExtTest.xs:61:18: warning: unused parameter 'my_perl' [-Wunused-parameter]
ExtTest.c:317:1: warning: unused parameter 'my_perl' [-Wunused-parameter]
ExtTest.c:262:26: note: expanded from macro 'XS_EUPXS'
ExtTest.xs:166:5: warning: unused variable 'my_perl' [-Wunused-variable]
../../../../perl.h:180:19: note: expanded from macro 'dTHX'
ExtTest.c:357:1: warning: unused parameter 'my_perl' [-Wunused-parameter]
ExtTest.xs:69:13: warning: unused parameter 'my_perl' [-Wunused-parameter]
ExtTest.xs:108:11: warning: unused parameter 'my_perl' [-Wunused-parameter]
ExtTest.c:336:1: warning: unused parameter 'my_perl' [-Wunused-parameter]
ExtTest.c:281:26: note: expanded from macro 'XS_EUPXS'
ExtTest.c:443:1: warning: unused parameter 'my_perl' [-Wunused-parameter]
ExtTest.xs:30:11: warning: unused parameter 'my_perl' [-Wunused-parameter]
ExtTest.c:269:1: warning: unused parameter 'my_perl' [-Wunused-parameter]
ExtTest.c:214:26: note: expanded from macro 'XS_EUPXS'
ExtTest.c:377:1: warning: unused parameter 'my_perl' [-Wunused-parameter]
ExtTest.xs:161:11: warning: unused parameter 'my_perl' [-Wunused-parameter]
ExtTest.c:353:1: warning: unused parameter 'my_perl' [-Wunused-parameter]
ExtTest.c:298:26: note: expanded from macro 'XS_EUPXS'
ExtTest.c:461:1: warning: unused parameter 'my_perl' [-Wunused-parameter]
ExtTest.xs:115:11: warning: unused parameter 'my_perl' [-Wunused-parameter]
ExtTest.c:334:1: warning: unused parameter 'my_perl' [-Wunused-parameter]
ExtTest.c:279:26: note: expanded from macro 'XS_EUPXS'
ExtTest.c:442:1: warning: unused parameter 'my_perl' [-Wunused-parameter]
ExtTest.xs:71:13: warning: unused parameter 'my_perl' [-Wunused-parameter]
ExtTest.c:310:1: warning: unused parameter 'my_perl' [-Wunused-parameter]
ExtTest.c:255:26: note: expanded from macro 'XS_EUPXS'
ExtTest.c:418:1: warning: unused parameter 'my_perl' [-Wunused-parameter]
<scratch space>:15:1: note: expanded from here
<scratch space>:185:1: note: expanded from here
<scratch space>:188:1: note: expanded from here
<scratch space>:130:1: note: expanded from here
<scratch space>:133:1: note: expanded from here
<scratch space>:172:1: note: expanded from here
<scratch space>:175:1: note: expanded from here
<scratch space>:24:1: note: expanded from here
<scratch space>:55:1: note: expanded from here
<scratch space>:76:1: note: expanded from here
<scratch space>:168:1: note: expanded from here
<scratch space>:171:1: note: expanded from here
<scratch space>:174:1: note: expanded from here
<scratch space>:77:1: note: expanded from here
<scratch space>:166:1: note: expanded from here
<scratch space>:114:1: note: expanded from here
<scratch space>:177:1: note: expanded from here
<scratch space>:180:1: note: expanded from here
<scratch space>:49:1: note: expanded from here
<scratch space>:97:1: note: expanded from here

Non-Fatal messages(gcc):



-- 
Report by Test::Smoke v1.71 running on perl 5.26.1
(Reporter v0.053 / Smoker v0.046)



nntp.perl.org: Perl Programming lists via nntp and http.
Comments to Ask Bjørn Hansen at ask@perl.org | Group listing | About