develooper Front page | perl.daily-build.reports | Postings from December 2019

Smoke [smoke-me/khw-netbsd] v5.31.7-13-gcff6752ff0 FAIL(F) linux5.3.0-3-amd64 [Debian GNU/Linux bullseye/sid] (x86_64/1 cpu)

From:
Carlos Guevara
Date:
December 24, 2019 17:13
Subject:
Smoke [smoke-me/khw-netbsd] v5.31.7-13-gcff6752ff0 FAIL(F) linux5.3.0-3-amd64 [Debian GNU/Linux bullseye/sid] (x86_64/1 cpu)
Message ID:
E1ijnke-002C9I-3J@cjg-bullseye
Automated smoke report for branch smoke-me/khw-netbsd 5.31.8 patch cff6752ff0fa1b21a32882062574746f5105c54e v5.31.7-13-gcff6752ff0
cjg-bullseye: Intel(R) Xeon(R) CPU E5-2620 v2 @ 2.10GHz (GenuineIntel 2060MHz) (x86_64/1 cpu)
    on        linux - 5.3.0-3-amd64 [Debian GNU/Linux bullseye/sid]
    using     g++ version 9.2.1 20191130
    smoketime 6 hours 39 minutes (average 33 minutes 16 seconds)

Summary: FAIL(F)

O = OK  F = Failure(s), extended report at the bottom
X = Failure(s) under TEST but not under harness
? = still running or test results not (yet) available
Build failures during:       - = unknown or N/A
c = Configure, m = make, M = make (after miniperl), t = make test-prep

v5.31.7-13-gcff6752ff0  Configuration (common) -Dcc=g++
----------- ---------------------------------------------------------
O O         
O O         -Duse64bitall
F O         -Dusequadmath
O O         -Duseithreads
F O         -Duseithreads -Duse64bitall
O F         -Duseithreads -Dusequadmath
| +--------- -DDEBUGGING
+----------- no debugging


Locally applied patches:
    SMOKEcff6752ff0fa1b21a32882062574746f5105c54e

Testsuite was run only with 'harness'

Tests skipped on user request:
    # One test name on a line
Failures: (common-args) -Dcc=g++
[default] -Dusequadmath
../dist/Time-HiRes/t/usleep.t...............................FAILED
    6
    Non-zero exit status: 1

[default] -Duseithreads -Duse64bitall
../dist/Time-HiRes/t/nanosleep.t............................FAILED
    3
    Non-zero exit status: 1

[default] -DDEBUGGING -Duseithreads -Dusequadmath
../cpan/ExtUtils-Constant/t/Constant.t......................FAILED
    259
    Bad plan.  You planned 302 tests but ran 259.

Compiler messages(gcc):
RealPPPort.c: In function 'void XS_Devel__PPPort_isASCII_utf8_safe(CV*)':
RealPPPort.c:4932:6: warning: unused variable 'offset' [-Wunused-variable]
RealPPPort.c: In function 'void XS_Devel__PPPort_isASCII_LC_utf8_safe(CV*)':
RealPPPort.c:5638:6: warning: unused variable 'offset' [-Wunused-variable]
Encode.c: In function 'void XS_Encode_decode(CV*)':
../../XSUB.h:185:20: warning: unused variable 'ix' [-Wunused-variable]
../../XSUB.h:185:20: note: in definition of macro 'dXSI32'
Encode.c: In function 'void XS_Encode_encode(CV*)':
./const-xs.inc:131:13: warning: AI_IDN_ALLOW_UNASSIGNED is deprecated
./const-xs.inc:134:13: warning: AI_IDN_USE_STD3_ASCII_RULES is deprecated
./const-xs.inc:386:13: warning: NI_IDN_ALLOW_UNASSIGNED is deprecated
./const-xs.inc:389:13: warning: NI_IDN_USE_STD3_ASCII_RULES is deprecated
HiRes.xs: In function 'void XS_Time__HiRes_setitimer(CV*)':
../../perl.h:423:30: warning: option '-Wc++-compat' is valid for C/ObjC but not for C++ [-Wpragmas]
../../perl.h:426:30: note: in expansion of macro 'GCC_DIAG_PRAGMA'
../../perl.h:434:33: note: in expansion of macro 'GCC_DIAG_IGNORE'
HiRes.xs:1436:9: note: in expansion of macro 'GCC_DIAG_IGNORE_STMT'
HiRes.xs: In function 'void XS_Time__HiRes_getitimer(CV*)':
HiRes.xs:1456:9: note: in expansion of macro 'GCC_DIAG_IGNORE_STMT'
op.c: In function 'OP* S_pmtrans(OP*, OP*, OP*)':
op.c:7052:22: warning: 'r_map' may be used uninitialized in this function [-Wmaybe-uninitialized]
RealPPPort.c: In function 'void XS_Devel__PPPort_isASCII_utf8_safe(PerlInterpreter*, CV*)':
RealPPPort.c: In function 'void XS_Devel__PPPort_isASCII_LC_utf8_safe(PerlInterpreter*, CV*)':
Encode.c: In function 'void XS_Encode_decode(PerlInterpreter*, CV*)':
Encode.c: In function 'void XS_Encode_encode(PerlInterpreter*, CV*)':
HiRes.xs: In function 'void XS_Time__HiRes_setitimer(PerlInterpreter*, CV*)':
HiRes.xs: In function 'void XS_Time__HiRes_getitimer(PerlInterpreter*, CV*)':
op.c: In function 'OP* S_pmtrans(PerlInterpreter*, OP*, OP*, OP*)':

Non-Fatal messages(gcc):



-- 
Report by Test::Smoke v1.71 running on perl 5.26.1
(Reporter v0.053 / Smoker v0.046)



nntp.perl.org: Perl Programming lists via nntp and http.
Comments to Ask Bjørn Hansen at ask@perl.org | Group listing | About