develooper Front page | perl.daily-build.reports | Postings from December 2019

Smoke [smoke-me/jkeenan/gh-16300-module-install]v5.31.6-156-g429da47 FAIL(F) linux 4.4.0-170-generic [Ubuntu 16.04.6 LTS(x86_64/1 cpu)

From:
Carlos Guevara
Date:
December 24, 2019 16:03
Subject:
Smoke [smoke-me/jkeenan/gh-16300-module-install]v5.31.6-156-g429da47 FAIL(F) linux 4.4.0-170-generic [Ubuntu 16.04.6 LTS(x86_64/1 cpu)
Message ID:
20191224160317.73B3F15F53A@cjg-xenial
Automated smoke report for branch smoke-me/jkeenan/gh-16300-module-install 5.31.7 patch 429da47739b54c684c7c3b6b37de386c3ae59261 v5.31.6-156-g429da47
cjg-xenial: Intel(R) Xeon(R) CPU E5-2620 v2 @ 2.10GHz (GenuineIntel 2060MHz) (x86_64/1 cpu)
    on        linux - 4.4.0-170-generic [Ubuntu 16.04.6 LTS (xenial)]
    using     gcc version 5.4.0 20160609
    smoketime 6 hours 19 minutes (average 31 minutes 37 seconds)

Summary: FAIL(F)

O = OK  F = Failure(s), extended report at the bottom
X = Failure(s) under TEST but not under harness
? = still running or test results not (yet) available
Build failures during:       - = unknown or N/A
c = Configure, m = make, M = make (after miniperl), t = make test-prep

v5.31.6-156-g429da47  Configuration (common) -Dcc=gcc
----------- ---------------------------------------------------------
O F         
O F         -Duse64bitall
O F         -Dusequadmath
O F         -Duseithreads
F O         -Duseithreads -Duse64bitall
O F         -Duseithreads -Dusequadmath
| +--------- -DDEBUGGING
+----------- no debugging


Locally applied patches:
    SMOKE429da47739b54c684c7c3b6b37de386c3ae59261

Testsuite was run only with 'harness'

Tests skipped on user request:
    # One test name on a line
Failures: (common-args) -Dcc=gcc
[default] -DDEBUGGING
../cpan/ExtUtils-MakeMaker/t/eu_command.t...................FAILED
    8
    Non-zero exit status: 1

[default] -DDEBUGGING -Duse64bitall
[default] -Duseithreads -Duse64bitall
../dist/Time-HiRes/t/usleep.t...............................FAILED
    6
    Non-zero exit status: 1

[default] -DDEBUGGING -Dusequadmath
../dist/Time-HiRes/t/usleep.t...............................FAILED
    3
    Non-zero exit status: 1

[default] -DDEBUGGING -Duseithreads
../dist/Time-HiRes/t/usleep.t...............................FAILED
    4
    Non-zero exit status: 1

[default] -DDEBUGGING -Duseithreads -Dusequadmath
../dist/IO/t/io_poll.t......................................FAILED
    12

Compiler messages(gcc):
RealPPPort.c: In function 'XS_Devel__PPPort_isASCII_utf8_safe':
RealPPPort.c:4932:6: warning: unused variable 'offset' [-Wunused-variable]
RealPPPort.c: In function 'XS_Devel__PPPort_isASCII_LC_utf8_safe':
RealPPPort.c:5638:6: warning: unused variable 'offset' [-Wunused-variable]
Encode.c: In function 'XS_Encode_decode':
../../XSUB.h:185:20: warning: unused variable 'ix' [-Wunused-variable]
Encode.c:1356:5: note: in expansion of macro 'dXSI32'
Encode.c: In function 'XS_Encode_encode':
Encode.c:1398:5: note: in expansion of macro 'dXSI32'
re_exec.c: In function 'S_regtry':
re_exec.c:6539:30: warning: 'fold_array' may be used uninitialized in this function [-Wmaybe-uninitialized]
re_exec.c:6443:17: note: 'fold_array' was declared here
re_exec.c:6545:22: warning: 'folder' may be used uninitialized in this function [-Wmaybe-uninitialized]
re_exec.c:6442:16: note: 'folder' was declared here
op.c: In function 'S_pmtrans':
op.c:7052:22: warning: 'r_map' may be used uninitialized in this function [-Wmaybe-uninitialized]

Non-Fatal messages(gcc):



-- 
Report by Test::Smoke v1.71 running on perl 5.26.1
(Reporter v0.053 / Smoker v0.046)



nntp.perl.org: Perl Programming lists via nntp and http.
Comments to Ask Bjørn Hansen at ask@perl.org | Group listing | About