develooper Front page | perl.daily-build.reports | Postings from December 2019

Smoke [smoke-me/khw-locale] v5.31.7-25-g2da4e2f FAIL(F) linux4.4.0-170-generic [Ubuntu 16.04.6 LTS (x86_64/1 cpu)

From:
Carlos Guevara
Date:
December 24, 2019 09:03
Subject:
Smoke [smoke-me/khw-locale] v5.31.7-25-g2da4e2f FAIL(F) linux4.4.0-170-generic [Ubuntu 16.04.6 LTS (x86_64/1 cpu)
Message ID:
20191224090251.081E41609D1@cjg-xenial
Automated smoke report for branch smoke-me/khw-locale 5.31.8 patch 2da4e2f021c542a45bd18951f5416baa28221ae4 v5.31.7-25-g2da4e2f
cjg-xenial: Intel(R) Xeon(R) CPU E5-2620 v2 @ 2.10GHz (GenuineIntel 2060MHz) (x86_64/1 cpu)
    on        linux - 4.4.0-170-generic [Ubuntu 16.04.6 LTS (xenial)]
    using     g++ version 5.4.0 20160609
    smoketime 6 hours 17 minutes (average 31 minutes 27 seconds)

Summary: FAIL(F)

O = OK  F = Failure(s), extended report at the bottom
X = Failure(s) under TEST but not under harness
? = still running or test results not (yet) available
Build failures during:       - = unknown or N/A
c = Configure, m = make, M = make (after miniperl), t = make test-prep

v5.31.7-25-g2da4e2f  Configuration (common) -Dcc=g++
----------- ---------------------------------------------------------
F O         
O O         -Duse64bitall
O O         -Dusequadmath
O O         -Duseithreads
F F         -Duseithreads -Duse64bitall
O O         -Duseithreads -Dusequadmath
| +--------- -DDEBUGGING
+----------- no debugging


Locally applied patches:
    SMOKE2da4e2f021c542a45bd18951f5416baa28221ae4

Testsuite was run only with 'harness'

Tests skipped on user request:
    # One test name on a line
Failures: (common-args) -Dcc=g++
[default] 
../dist/Time-HiRes/t/usleep.t...............................FAILED
    4
    Non-zero exit status: 1

[default] -Duseithreads -Duse64bitall
../dist/Time-HiRes/t/usleep.t...............................FAILED
    5
    Non-zero exit status: 1

[default] -DDEBUGGING -Duseithreads -Duse64bitall
../dist/Time-HiRes/t/nanosleep.t............................FAILED
    3
    Non-zero exit status: 1

Compiler messages(gcc):
regcomp.h: In function 'ssize_t S_study_chunk(RExC_state_t*, regnode**, ssize_t*, ssize_t*, regnode*, scan_data_t*, I32, U32, regnode_ssc*, U32, U32)':
regcomp.h:358:38: warning: '<anonymous>' may be used uninitialized in this function [-Wmaybe-uninitialized]
regcomp.h:330:22: note: '<anonymous>' was declared here
regcomp.h:358:22: note: in expansion of macro 'OP'
regcomp.c:4141:37: note: in expansion of macro 'STR_LEN'
RealPPPort.c: In function 'void XS_Devel__PPPort_isASCII_utf8_safe(CV*)':
RealPPPort.c:4932:6: warning: unused variable 'offset' [-Wunused-variable]
RealPPPort.c: In function 'void XS_Devel__PPPort_isASCII_LC_utf8_safe(CV*)':
RealPPPort.c:5638:6: warning: unused variable 'offset' [-Wunused-variable]
Encode.c: In function 'void XS_Encode_decode(CV*)':
../../XSUB.h:185:20: warning: unused variable 'ix' [-Wunused-variable]
Encode.c:1356:5: note: in expansion of macro 'dXSI32'
Encode.c: In function 'void XS_Encode_encode(CV*)':
Encode.c:1398:5: note: in expansion of macro 'dXSI32'
re_exec.c: In function 'bool S_regtry(regmatch_info*, char**)':
re_exec.c:6539:38: warning: 'fold_array' may be used uninitialized in this function [-Wmaybe-uninitialized]
re_exec.c:6443:17: note: 'fold_array' was declared here
re_exec.c:6545:28: warning: 'folder' may be used uninitialized in this function [-Wmaybe-uninitialized]
re_exec.c:6442:16: note: 'folder' was declared here
../../regcomp.h: In function 'ssize_t S_study_chunk(RExC_state_t*, regnode**, ssize_t*, ssize_t*, regnode*, scan_data_t*, I32, U32, regnode_ssc*, U32, U32)':
../../regcomp.h:358:38: warning: '<anonymous>' may be used uninitialized in this function [-Wmaybe-uninitialized]
../../regcomp.h:330:22: note: '<anonymous>' was declared here
../../regcomp.h:358:22: note: in expansion of macro 'OP'
re_comp.c:4108:31: note: in expansion of macro 'STR_LEN'
../../regcomp.h:352:48: warning: '<anonymous>' may be used uninitialized in this function [-Wmaybe-uninitialized]
../../regcomp.h:352:22: note: in expansion of macro '__ASSERT_'
../../regcomp.h:352:32: note: in expansion of macro 'OP'
../../regcomp.h:359:50: note: in expansion of macro 'STR_LENl'
../../regcomp.h:334:48: warning: '<anonymous>' may be used uninitialized in this function [-Wmaybe-uninitialized]
../../regcomp.h:334:22: note: in expansion of macro '__ASSERT_'
../../regcomp.h:334:32: note: in expansion of macro 'OP'
../../regcomp.h:359:64: note: in expansion of macro 'STR_LENs'
re_comp.c:4141:37: note: in expansion of macro 'STR_LEN'
op.c: In function 'OP* S_pmtrans(OP*, OP*, OP*)':
op.c:7052:35: warning: 'r_map' may be used uninitialized in this function [-Wmaybe-uninitialized]
regcomp.c:4108:31: note: in expansion of macro 'STR_LEN'
regcomp.h:352:48: warning: '<anonymous>' may be used uninitialized in this function [-Wmaybe-uninitialized]
regcomp.h:352:22: note: in expansion of macro '__ASSERT_'
regcomp.h:352:32: note: in expansion of macro 'OP'
regcomp.h:359:50: note: in expansion of macro 'STR_LENl'
regcomp.h:334:48: warning: '<anonymous>' may be used uninitialized in this function [-Wmaybe-uninitialized]
regcomp.h:334:22: note: in expansion of macro '__ASSERT_'
regcomp.h:334:32: note: in expansion of macro 'OP'
regcomp.h:359:64: note: in expansion of macro 'STR_LENs'
regcomp.h: In function 'ssize_t S_study_chunk(PerlInterpreter*, RExC_state_t*, regnode**, ssize_t*, ssize_t*, regnode*, scan_data_t*, I32, U32, regnode_ssc*, U32, U32)':
RealPPPort.c: In function 'void XS_Devel__PPPort_isASCII_utf8_safe(PerlInterpreter*, CV*)':
RealPPPort.c: In function 'void XS_Devel__PPPort_isASCII_LC_utf8_safe(PerlInterpreter*, CV*)':
Encode.c: In function 'void XS_Encode_decode(PerlInterpreter*, CV*)':
Encode.c: In function 'void XS_Encode_encode(PerlInterpreter*, CV*)':
re_exec.c: In function 'bool S_regtry(PerlInterpreter*, regmatch_info*, char**)':
../../regcomp.h: In function 'ssize_t S_study_chunk(PerlInterpreter*, RExC_state_t*, regnode**, ssize_t*, ssize_t*, regnode*, scan_data_t*, I32, U32, regnode_ssc*, U32, U32)':
op.c: In function 'OP* S_pmtrans(PerlInterpreter*, OP*, OP*, OP*)':

Non-Fatal messages(gcc):



-- 
Report by Test::Smoke v1.71 running on perl 5.26.1
(Reporter v0.053 / Smoker v0.046)



nntp.perl.org: Perl Programming lists via nntp and http.
Comments to Ask Bjørn Hansen at ask@perl.org | Group listing | About