develooper Front page | perl.daily-build.reports | Postings from December 2019

Smoke [smoke-me/khw-locale] v5.31.7-25-g2da4e2f021 FAIL(F) openbsd6.6 (amd64/1 cpu)

Thread Previous
From:
Carlos Guevara
Date:
December 24, 2019 00:38
Subject:
Smoke [smoke-me/khw-locale] v5.31.7-25-g2da4e2f021 FAIL(F) openbsd6.6 (amd64/1 cpu)
Message ID:
77ac2d1d4913988c@cjg-openbsd6
Automated smoke report for branch smoke-me/khw-locale 5.31.8 patch 2da4e2f021c542a45bd18951f5416baa28221ae4 v5.31.7-25-g2da4e2f021
cjg-openbsd6: Intel(R) Xeon(R) CPU E5-2620 v2 @ 2.10GHz (2060 MHz) (amd64/1 cpu)
    on        openbsd - 6.6
    using     clang version 4.2.1 Compatible OpenBSD Clang 8.0.1 (tags/RELEASE_801/final)
    smoketime 12 hours 1 minute (average 1 hour)

Summary: FAIL(F)

O = OK  F = Failure(s), extended report at the bottom
X = Failure(s) under TEST but not under harness
? = still running or test results not (yet) available
Build failures during:       - = unknown or N/A
c = Configure, m = make, M = make (after miniperl), t = make test-prep

v5.31.7-25-g2da4e2f021  Configuration (common) -Dcc=clang
----------- ---------------------------------------------------------
F F         
F F         -Duse64bitall
F F         -Duselongdouble
F F         -Duseithreads
F F         -Duseithreads -Duse64bitall
F F         -Duseithreads -Duselongdouble
| +--------- -DDEBUGGING
+----------- no debugging


Locally applied patches:
    SMOKE2da4e2f021c542a45bd18951f5416baa28221ae4

Testsuite was run only with 'harness'

Tests skipped on user request:
    # One test name on a line
Failures: (common-args) -Dcc=clang
[default] 
[default] -DDEBUGGING
[default] -Duse64bitall
[default] -DDEBUGGING -Duse64bitall
[default] -Duselongdouble
[default] -DDEBUGGING -Duselongdouble
../dist/IO/t/cachepropagate-unix.t..........................FAILED
    14
    Non-zero exit status: 1

[default] -Duseithreads
[default] -DDEBUGGING -Duseithreads
[default] -Duseithreads -Duse64bitall
[default] -DDEBUGGING -Duseithreads -Duse64bitall
[default] -Duseithreads -Duselongdouble
[default] -DDEBUGGING -Duseithreads -Duselongdouble
../dist/IO/t/cachepropagate-unix.t..........................FAILED
    14
    Non-zero exit status: 1
../ext/POSIX/t/mb.t.........................................FAILED
    6, 12, 15

Compiler messages(gcc):
sv.c:12539:41: warning: adding 'int' to a string does not append to the string [-Wstring-plus-int]
./handy.h:545:37: note: expanded from macro 'strnEQ'
sv.c:12539:41: note: use array indexing to silence this warning
RealPPPort.c:4932:6: warning: unused variable 'offset' [-Wunused-variable]
RealPPPort.c:5638:6: warning: unused variable 'offset' [-Wunused-variable]
Encode.c:1356:5: warning: unused variable 'ix' [-Wunused-variable]
../../XSUB.h:185:20: note: expanded from macro 'dXSI32'
Encode.c:1398:5: warning: unused variable 'ix' [-Wunused-variable]
op.c:7867:13: warning: format specifies type 'double' but the argument has type 'NV' (aka 'long double') [-Wformat]
./perl.h:4275:44: note: expanded from macro 'DEBUG_y'
./perl.h:4242:36: note: expanded from macro 'DEBUG__'

Non-Fatal messages(gcc):



-- 
Report by Test::Smoke v1.71 running on perl 5.26.1
(Reporter v0.053 / Smoker v0.046)

Thread Previous


nntp.perl.org: Perl Programming lists via nntp and http.
Comments to Ask Bjørn Hansen at ask@perl.org | Group listing | About